AnsweredAssumed Answered

openssl doesn't compile for bf548 on 2011R1

Question asked by MarkBishop on Apr 5, 2012
Latest reply on Apr 26, 2012 by Aaronwu

make[3]: Leaving directory `/home/mark/new_image/uclinux-dist/user/mtd-utils'

[ ! -d "openssl" ] || ( touch openssl/.sgbuilt_user && make -C openssl ) || exit $?

make[3]: Entering directory `/home/mark/new_image/uclinux-dist/user/openssl'

make[3]: *** No rule to make target `progs.pl', needed by `progs.h'.  Stop.

make[3]: Leaving directory `/home/mark/new_image/uclinux-dist/user/openssl'

make[2]: *** [openssl] Error 2

make[2]: Leaving directory `/home/mark/new_image/uclinux-dist/user'

make[1]: *** [all] Error 2

make[1]: Leaving directory `/home/mark/new_image/uclinux-dist/user'

make: *** [subdirs] Error 1

cooper@linux-hez9:/home/mark/new_image/uclinux-dist>

Outcomes