FMComms3 + Zed Production Testing Failing

Hello,

I am just starting with an FMComms3, paired with a Zedboard. I am loading the board with the latest image off of the analog website, no modifications. I want to prove to myself that the part is working, so I am performing the production testing mentioned in the Wiki.

https://wiki.analog.com/resources/eval/user-guides/ad-fmcomms2-ebz/testing

Expected: No failed test cases in console output, no error windows, test passes, and the device powers down (as per script).

Observed: While most test cases pass, there are a couple errors which I would like to understand.

First, since I launched it from the command line, I can see the following errors (full console output is at the bottom of the post):

dds_locked_freq_cb: error : 0
dds_locked_phase_cb: error
dds_locked_freq_cb: error : 0
dds_locked_phase_cb: error

Next, I get an error pop-up window labeled "DCXO Calibration" with the text "Failed to connect to Programmable Counter device".

This stops the console output, so that when I close the pop-up, the following is printed.

Sequential loading of profile aborted.
capture_profile_save: unknown context local

Then, the plugins are closed, and the application closes, without powering off the board.

So, my question is, can the test be fixed? Are these failures of a hardware or software/configuration nature? Does it matter that these are failing?

Thank you very much for your help in this; please ask for any information that would be helpful.

The full console output:

root@analog:/home/analog# test_fmcomms2.sh 
Fontconfig warning: ignoring C.UTF-8: not a valid language tag
Found plugin: ad9739a
Found plugin: DAQ1/2/3
Found plugin: Spectrum Analyzer
Found plugin: CN0357
Found plugin: AD6676
Found plugin: FMCADC3
Found plugin: SCPI
Found plugin: FMComms5
Found plugin: ADRV9009
Found plugin: AD9371 Advanced
Found plugin: FMComms1
Found plugin: AD9371
Found plugin: FMComms2/3/4
Found plugin: Debug
Found plugin: ADRV9009 Advanced
Found plugin: FMCOMMS11
Found plugin: AD5628-1
Found plugin: Motor Control
Found plugin: AD7303
Found plugin: FMComms2/3/4/5 Advanced
Found plugin: DMM
Found plugin: FMComms6
Found plugin: Partial Reconfiguration
Loaded plugin: Spectrum Analyzer
Loaded plugin: SCPI
Updating widgets...
Updating FIR filter...
Loaded plugin: FMComms2/3/4
Loaded plugin: Debug
Loaded plugin: FMComms2/3/4/5 Advanced
Loaded plugin: DMM
Loading profile sequentially from /tmp/osc_3067.ini
Ignoring token 'test' when loading sequentially

(osc:3067): Gdk-CRITICAL **: gdk_window_move_resize_internal: assertion 'GDK_IS_WINDOW (window)' failed

(osc:3067): Gdk-CRITICAL **: _gdk_pixmap_new: assertion '(drawable != NULL) || (depth != -1)' failed
Closing plugin: Spectrum Analyzer
Closing plugin: SCPI
Closing plugin: FMComms2/3/4
Closing plugin: Debug
Closing plugin: FMComms2/3/4/5 Advanced
Closing plugin: DMM
Found plugin: ad9739a
Found plugin: DAQ1/2/3
Found plugin: Spectrum Analyzer
Found plugin: CN0357
Found plugin: AD6676
Found plugin: FMCADC3
Found plugin: SCPI
Found plugin: FMComms5
Found plugin: ADRV9009
Found plugin: AD9371 Advanced
Found plugin: FMComms1
Found plugin: AD9371
Found plugin: FMComms2/3/4
Found plugin: Debug
Found plugin: ADRV9009 Advanced
Found plugin: FMCOMMS11
Found plugin: AD5628-1
Found plugin: Motor Control
Found plugin: AD7303
Found plugin: FMComms2/3/4/5 Advanced
Found plugin: DMM
Found plugin: FMComms6
Found plugin: Partial Reconfiguration
Loaded plugin: Spectrum Analyzer
Loaded plugin: SCPI
Updating widgets...
Updating FIR filter...
Loaded plugin: FMComms2/3/4
Loaded plugin: Debug
Loaded plugin: FMComms2/3/4/5 Advanced
Loaded plugin: DMM

(osc:3067): Gdk-CRITICAL **: gdk_window_move_resize_internal: assertion 'GDK_IS_WINDOW (window)' failed

(osc:3067): Gdk-CRITICAL **: _gdk_pixmap_new: assertion '(drawable != NULL) || (depth != -1)' failed
set to single tone markers
Line 44: (test.ad7291.in_temp0_raw.int = 80 160): value = 126
Test passed.
Line 50: (test.ad7291.in_voltage0_raw.int = 3045 3629): value = 3354
Test passed.
Line 52: (test.ad7291.in_voltage1_raw.int = 3045 3629): value = 3364
Test passed.
Line 54: (test.ad7291.in_voltage2_raw.int = 3045 3629): value = 3355
Test passed.
Line 56: (test.ad7291.in_voltage3_raw.int = 1231 1393): value = 1315
Test passed.
Line 58: (test.ad7291.in_voltage4_raw.int = 1661 2749): value = 1810
Test passed.
Line 60: (test.ad7291.in_voltage5_raw.int = 1231 1393): value = 1301
Test passed.
dds_locked_freq_cb: error : 0
dds_locked_phase_cb: error
dds_locked_freq_cb: error : 0
dds_locked_phase_cb: error
Line 131: (test.ad9361-phy.in_voltage0_rssi.int = 75 150): value = 111
Test passed.
Line 132: (test.ad9361-phy.in_voltage1_rssi.int = 75 150): value = 110
Test passed.
Line 135: (test.ad9361-phy.in_voltage0_hardwaregain.double = 50.0 80.0): value = 71.000000
Test passed.
Line 136: (test.ad9361-phy.in_voltage0_hardwaregain.double = 50.0 80.0): value = 71.000000
Test passed.
Line 150: (test.ad9361-phy.in_voltage0_rssi.int = 10 50): value = 45
Test passed.
Line 151: (test.ad9361-phy.in_voltage1_rssi.int = 10 50): value = 45
Test passed.
Line 154: (test.ad9361-phy.in_voltage0_hardwaregain.double = 0.0 28.0): value = 23.000000
Test passed.
Line 155: (test.ad9361-phy.in_voltage0_hardwaregain.double = 0.0 28.0): value = 23.000000
Test passed.
Sequential loading of profile aborted.
capture_profile_save: unknown context local
Closing plugin: Spectrum Analyzer
Closing plugin: SCPI
Closing plugin: FMComms2/3/4
Closing plugin: Debug
Closing plugin: FMComms2/3/4/5 Advanced
Closing plugin: DMM
root@analog:/home/analog#