Article [#5549] Build default bf537 kernel fails at ad73322 driver in latest trunk

[#5549] Build default bf537 kernel fails at ad73322 driver in latest trunk

Submitted By: Vivi Li

Open Date

2009-09-23 04:03:58     Close Date

2009-09-23 22:46:11

Priority:

Medium     Assignee:

Cliff Cai

Status:

Closed     Fixed In Release:

N/A

Found In Release:

2010R1     Release:

Category:

Make Errors     Board:

N/A

Processor:

ALL     Silicon Revision:

Is this bug repeatable?:

Yes     Resolution:

Fixed

Uboot version or rev.:

    Toolchain version or rev.:

gcc4.1-09r1-rc9

App binary format:

N/A     

Summary: Build default bf537 kernel fails at ad73322 driver in latest trunk

Details:

Build default bf537 kernel fails at ad73322 driver in latest trunk.

Bellow is the log:

--

sound/blackfin/ad73322.c:50:26: error: sound/driver.h: No such file or directory^M

sound/blackfin/ad73322.c: In function ‘snd_ad73322_probe’:^M

sound/blackfin/ad73322.c:844: error: implicit declaration of function ‘snd_card_new’^M

sound/blackfin/ad73322.c:844: warning: assignment makes pointer from integer without a cast^M

make[3]: *** [sound/blackfin/ad73322.o] Error 1^M

--

Follow-ups

--- Cliff Cai                                                2009-09-23 04:37:20

fixed,the sound kernel API has changed.

Cliff

--- Vivi Li                                                  2009-09-23 22:46:11

OK now. Close it.

    Files

    Changes

    Commits

    Dependencies

    Duplicates

    Associations

    Tags

File Name     File Type     File Size     Posted By

No Files Were Found

Before You Switch


Switching languages will make ADI Explorer unavailable. Resume your session by switching back to English and reopening ADI Explorer.