Article [#6708] build strace fails now when checking syscall list(2011)

[#6708] build strace fails now when checking syscall list

Submitted By: Mingquan Pan

Open Date

2011-07-28 21:58:11     Close Date

2011-08-12 03:15:30

Priority:

Medium     Assignee:

steven miao

Status:

Closed     Fixed In Release:

N/A

Found In Release:

2011R1     Release:

Category:

N/A     Board:

N/A

Processor:

ALL     Silicon Revision:

Is this bug repeatable?:

Yes     Resolution:

Fixed

Uboot version or rev.:

    Toolchain version or rev.:

5013

App binary format:

N/A     

Summary: build strace fails now when checking syscall list

Details:

build strace fails now when checking syscall list .

checking for perl... /usr/bin/perl^M

configure: creating ./config.status^M

config.status: creating Makefile^M

config.status: creating tests/Makefile^M

config.status: creating config.h^M

config.status: executing depfiles commands^M

configure: WARNING: unrecognized options: --enable-fast-install^M

  AR      miscutils/lib.a^M

  LINK    busybox_unstripped^M

Trying libraries: crypt m^M

Library crypt is not needed, excluding it^M

Library m is not needed, excluding it^M

Final link with: <none>^M

make[4]: Leaving directory `/home/test/work/cruise/checkouts/uclinux-dist/user/busybox/build-busybox-1.18.4'^M

make[3]: Leaving directory `/home/test/work/cruise/checkouts/uclinux-dist/user/busybox'^M

FAIL! (see /home/test/work/cruise/checkouts/uclinux-dist/user/strace/strace-4.6/ioctlent.linux.h.in)^M

ioctl list (bfin) ... OK!^M

signal list ... OK!^M

syscall list ... FAIL! (see /home/test/work/cruise/checkouts/uclinux-dist/user/strace/strace-4.6/syscallent.h)^M

make[3]: *** [.check] Error 1^M

make[3]: Leaving directory `/home/test/work/cruise/checkouts/uclinux-dist/user/strace'^M

make[2]: *** [strace] Error 2^M

make[2]: Leaving directory `/home/test/work/cruise/checkouts/uclinux-dist/user'^M

make[1]: *** [all] Error 2^M

make[1]: Leaving directory `/home/test/work/cruise/checkouts/uclinux-dist/user'^M

make: *** [subdirs] Error 1^M

Follow-ups

--- steven miao                                              2011-08-08 06:53:25

list has been updated

--- Mingquan Pan                                             2011-08-12 03:15:29

Yes,it is ok now.

Close.

    Files

    Changes

    Commits

    Dependencies

    Duplicates

    Associations

    Tags

File Name     File Type     File Size     Posted By

No Files Were Found

Before You Switch


Switching languages will make ADI Explorer unavailable. Resume your session by switching back to English and reopening ADI Explorer.