Article [#7078] build trunk head kernel for bf548 ezkit fails at ints-priority.c(2012)

[#7078] build trunk head kernel for bf548 ezkit fails at ints-priority.c

Submitted By: Mingquan Pan

Open Date

2012-04-26 23:06:09     Close Date

2012-05-04 03:52:04

Priority:

Medium High     Assignee:

Nobody

Status:

Closed     Fixed In Release:

N/A

Found In Release:

N/A     Release:

Category:

N/A     Board:

N/A

Processor:

BF548     Silicon Revision:

Is this bug repeatable?:

Yes     Resolution:

Fixed

Uboot version or rev.:

    Toolchain version or rev.:

ADI-trunk/svn-5764

App binary format:

N/A     

Summary: build trunk head kernel for bf548 ezkit fails at ints-priority.c

Details:

build trunk head kernel for bf548 ezkit fails at ints-priority.c.

  AS      arch/blackfin/mach-common/entry.o^M

  AS      arch/blackfin/mach-common/head.o^M

  CC      arch/blackfin/mm/maccess.o^M

arch/blackfin/kernel/setup.c: In function ‘setup_arch’:  CC      arch/blackfin/mach-bf548/ints-priority.o^M

^M

arch/blackfin/kernel/setup.c:895: warning: unused variable ‘clk’^M

  AS      arch/blackfin/mach-common/interrupt.o^M

  CC      arch/blackfin/mach-common/arch_checks.o^M

  CC      arch/blackfin/mach-bf548/dma.o^M

  LD      arch/blackfin/mm/built-in.o^M

  CC      arch/blackfin/kernel/signal.o^M

  CC      arch/blackfin/mach-common/ints-priority.o^M

arch/blackfin/mach-common/ints-priority.c: In function ‘bfin_gpio_set_wake’:^M

arch/blackfin/mach-common/ints-priority.c:1111: error: ‘IRQ_PINT4’ undeclared (first use in this function)^M

arch/blackfin/mach-common/ints-priority.c:1111: error: (Each undeclared identifier is reported only once^M

arch/blackfin/mach-common/ints-priority.c:1111: error: for each function it appears in.)^M

arch/blackfin/mach-common/ints-priority.c:1114: error: ‘IRQ_PINT5’ undeclared (first use in this function)^M

make[2]: *** [arch/blackfin/mach-common/ints-priority.o] Error 1^M

  LD      arch/blackfin/mach-bf548/built-in.o^M

make[1]: *** [arch/blackfin/mach-common] Error 2^M

Follow-ups

--- Vivi Li                                                  2012-05-04 04:49:15

It can build now. So close it.

    Files

    Changes

    Commits

    Dependencies

    Duplicates

    Associations

    Tags

File Name     File Type     File Size     Posted By

No Files Were Found

Before You Switch


Switching languages will make ADI Explorer unavailable. Resume your session by switching back to English and reopening ADI Explorer.