[#4727] Build u-boot-2008.10 failed with bf538f-ezkit at anomaly.h

Document created by Aaronwu Employee on Sep 25, 2013
Version 1Show Document
  • View in full screen mode

[#4727] Build u-boot-2008.10 failed with bf538f-ezkit at anomaly.h

Submitted By: Vivi Li

Open Date

2008-12-17 05:20:46     Close Date

2008-12-17 22:08:32

Priority:

Medium     Assignee:

Mike Frysinger

Category:

N/A     Fixed In Release:

N/A

Found In Release:

N/A     Status:

Closed

Board:

N/A     Processor:

N/A

Silicon Revision:

    Resolution:

Fixed

Is the bug repeatable?:

N/A     

Summary: Build u-boot-2008.10 failed with bf538f-ezkit at anomaly.h

Details:

 

Build u-boot-2008.10 failed with bf538f-ezkit at anomaly.h.

 

Bellow is the log:

--

bfin-uclinux-gcc -g  -Os   -ffixed-P5 -fomit-frame-pointer -mno-fdpic -ffunction-sections -fdata-sections -mcpu=bf538-0.3 -D__KERNEL__ -I/home/test/work/cruise/checkouts/u-boot/u-boot-2008.10/include -fno-builtin -ffreestanding -nostdinc -isystem /opt/uClinux/bfin-uclinux/bin/../lib/gcc/bfin-uclinux/4.1.2/include -pipe  -DCONFIG_BLACKFIN -Wall -Wstrict-prototypes -fno-stack-protector -c -o hello_world.o hello_world.c

In file included from /home/test/work/cruise/checkouts/u-boot/u-boot-2008.10/include/asm/blackfin_def.h:91,

                 from /home/test/work/cruise/checkouts/u-boot/u-boot-2008.10/include/asm/blackfin.h:9,

                 from /home/test/work/cruise/checkouts/u-boot/u-boot-2008.10/include/asm/string.h:33,

                 from /home/test/work/cruise/checkouts/u-boot/u-boot-2008.10/include/linux/string.h:21,

                 from /home/test/work/cruise/checkouts/u-boot/u-boot-2008.10/include/common.h:38,

                 from hello_world.c:24:

/home/test/work/cruise/checkouts/u-boot/u-boot-2008.10/include/asm/mach-bf538/anomaly.h:18:3: error: #error will not work on BF538 silicon version 0.0, 0.1, 0.2, or 0.3

make[2]: *** [hello_world.o] Error 1

make[2]: Leaving directory `/home/test/work/cruise/checkouts/u-boot/u-boot-2008.10/examples'

make[1]: *** [examples] Error 2

make[1]: Leaving directory `/home/test/work/cruise/checkouts/u-boot/u-boot-2008.10'

make: *** [bf538f-ezkit] Error 2

--

 

Follow-ups

 

--- Mike Frysinger                                           2008-12-17 05:34:53

ive changed the default rev to 0.4 since we dont plan on supporting 0.3 with

bf538

 

--- Vivi Li                                                  2008-12-17 22:08:32

OK now. close it. Thanks!

 

 

 

    Files

    Changes

    Commits

    Dependencies

    Duplicates

    Associations

    Tags

 

File Name     File Type     File Size     Posted By

No Files Were Found

Attachments

    Outcomes