[#4218] splash test on bf533-stamp failed in 08r1

Document created by Aaronwu Employee on Sep 25, 2013
Version 1Show Document
  • View in full screen mode

[#4218] splash test on bf533-stamp failed in 08r1

Submitted By: Vivi Li

Open Date

2008-07-03 06:47:51     Close Date

2008-07-18 06:42:35

Priority:

Medium     Assignee:

Mike Frysinger

Category:

N/A     Fixed In Release:

N/A

Found In Release:

N/A     Status:

Closed

Board:

N/A     Processor:

N/A

Silicon Revision:

    Resolution:

Fixed

Is the bug repeatable?:

N/A     

Summary: splash test on bf533-stamp failed in 08r1

Details:

 

The splash test on bf533-stamp is for the purpose of showing a picture through ad7171 when u-boot is running. Please refer to: https://docs.blackfin.uclinux.org/doku.php?id=bootloaders:u-boot:testing

 

Now it fails to build u-boot image for splash test.

--

bfin-uclinux-gcc -g  -Os   -ffixed-P5 -fomit-frame-pointer -mcpu=bf533-0.3 -D__KERNEL__ -I/home/test/work/cruise/checkouts/u-boot.2008R1.5-RC1/u-boot-1.1.6/include -fno-builtin -ffreestanding -nostdinc -isystem /opt/uClinux/bfin-uclinux/lib/gcc/bfin-uclinux/4.1.2/include -pipe  -DCONFIG_BLACKFIN -Wall -Wstrict-prototypes -c -o video.o video.c

video.c: In function ‘video_init’:

video.c:165: warning: assignment makes integer from pointer without a cast

video.c: In function ‘dma_bitblit’:

video.c:183: error: ‘LCD_PIXEL_SIZE’ undeclared (first use in this function)

video.c:183: error: (Each undeclared identifier is reported only once

video.c:183: error: for each function it appears in.)

video.c:183: error: ‘LCD_X_RES’ undeclared (first use in this function)

video.c: In function ‘drv_video_init’:

video.c:235: error: ‘LCD_X_RES’ undeclared (first use in this function)

video.c:235: error: ‘LCD_Y_RES’ undeclared (first use in this function)

video.c:235: error: ‘LCD_PIXEL_SIZE’ undeclared (first use in this function)

video.c:235: error: ‘ACTIVE_VIDEO_MEM_OFFSET’ undeclared (first use in this function)

video.c:255: error: ‘bfin_logo’ undeclared (first use in this function)

video.c:261: error: too many arguments to function ‘video_init’

make[1]: *** [video.o] Error 1

make[1]: Leaving directory `/home/test/work/cruise/checkouts/u-boot.2008R1.5-RC1/u-boot-1.1.6/board/bf533-stamp'

make: *** [board/bf533-stamp/libbf533-stamp.a] Error 2

--

 

Follow-ups

 

--- Vivi Li                                                  2008-07-03 06:49:58

I wonder if this case should be deleted, as ad7171 driver has been deleted from

kernel and we can show image on bf527/bf548 while running u-boot.

 

--- Mike Frysinger                                           2008-07-03 08:14:30

not a regression ... was broken in 2008R1 as well

 

--- Robin Getz                                               2008-07-03 20:37:49

Mike:

 

Still a regression - just has just been broken a long time (it did use to

work).

 

Why wasn't this tested on 2008R1? It is the first thing listed in the manual

test process:

https://docs.blackfin.uclinux.org/doku.php?id=bootloaders:u-boot:testing#manual_test

 

Aren't we following our own documentation?

 

--- Mike Frysinger                                           2008-07-03 23:06:34

yes, i meant it isnt a regression to 2008R1 ... it's supposed to work in older

releases.  i plan on fixing it, but i dont think it should hold up 2008R1.5.

 

--- Mike Frysinger                                           2008-07-18 05:40:44

should be fixed now in 2008R1.5+

 

--- Vivi Li                                                  2008-07-18 06:42:34

Yes, it's fixed now.

Close it. Thanks!

 

 

 

    Files

    Changes

    Commits

    Dependencies

    Duplicates

    Associations

    Tags

 

File Name     File Type     File Size     Posted By

No Files Were Found

Attachments

    Outcomes