[#3812] svn head u-boot build fails initcode.c on older parts

Document created by Aaronwu Employee on Sep 25, 2013
Version 1Show Document
  • View in full screen mode

[#3812] svn head u-boot build fails initcode.c on older parts

Submitted By: Mingquan Pan

Open Date

2008-01-04 00:54:22     Close Date

2008-01-06 20:04:17

Priority:

Medium     Assignee:

Mike Frysinger

Category:

N/A     Fixed In Release:

N/A

Found In Release:

N/A     Status:

Closed

Board:

N/A     Processor:

N/A

Silicon Revision:

    Resolution:

Fixed

Is the bug repeatable?:

N/A     

Summary: svn head u-boot build fails initcode.c on older parts

Details:

 

svn head u-boot build fails now.

 

bfin-uclinux-gcc -g  -Os   -ffixed-P5 -fomit-frame-pointer -mcpu=bf537-0.2 -D__KERNEL__ -I/home/test/work/cruise/checkouts/u-boot/u-boot-1.1.6/include -fno-builtin -ffreestanding -nostdinc -isystem /opt/uClinux/bfin-uclinux/bin/../lib/gcc/bfin-uclinux/4.1.2/include -pipe  -DCONFIG_BLACKFIN -Wall -Wstrict-prototypes -c -o cpu.o cpu.c

bfin-uclinux-gcc -g  -Os   -ffixed-P5 -fomit-frame-pointer -mcpu=bf537-0.2 -D__KERNEL__ -I/home/test/work/cruise/checkouts/u-boot/u-boot-1.1.6/include -fno-builtin -ffreestanding -nostdinc -isystem /opt/uClinux/bfin-uclinux/bin/../lib/gcc/bfin-uclinux/4.1.2/include -pipe  -DCONFIG_BLACKFIN -Wall -Wstrict-prototypes -c -o traps.o traps.c

bfin-uclinux-gcc -g  -Os   -ffixed-P5 -fomit-frame-pointer -mcpu=bf537-0.2 -D__KERNEL__ -I/home/test/work/cruise/checkouts/u-boot/u-boot-1.1.6/include -fno-builtin -ffreestanding -nostdinc -isystem /opt/uClinux/bfin-uclinux/bin/../lib/gcc/bfin-uclinux/4.1.2/include -pipe  -DCONFIG_BLACKFIN -Wall -Wstrict-prototypes -c -o interrupts.o interrupts.c

bfin-uclinux-gcc -g  -Os   -ffixed-P5 -fomit-frame-pointer -mcpu=bf537-0.2 -D__KERNEL__ -I/home/test/work/cruise/checkouts/u-boot/u-boot-1.1.6/include -fno-builtin -ffreestanding -nostdinc -isystem /opt/uClinux/bfin-uclinux/bin/../lib/gcc/bfin-uclinux/4.1.2/include -pipe  -DCONFIG_BLACKFIN -Wall -Wstrict-prototypes -c -o reset.o reset.c

bfin-uclinux-gcc -g  -Os   -ffixed-P5 -fomit-frame-pointer -mcpu=bf537-0.2 -D__KERNEL__ -I/home/test/work/cruise/checkouts/u-boot/u-boot-1.1.6/include -fno-builtin -ffreestanding -nostdinc -isystem /opt/uClinux/bfin-uclinux/bin/../lib/gcc/bfin-uclinux/4.1.2/include -pipe  -DCONFIG_BLACKFIN -Wall -Wstrict-prototypes -c -o serial.o serial.c

bfin-uclinux-gcc -g  -Os   -ffixed-P5 -fomit-frame-pointer -mcpu=bf537-0.2 -D__KERNEL__ -I/home/test/work/cruise/checkouts/u-boot/u-boot-1.1.6/include -fno-builtin -ffreestanding -nostdinc -isystem /opt/uClinux/bfin-uclinux/bin/../lib/gcc/bfin-uclinux/4.1.2/include -pipe  -DCONFIG_BLACKFIN -Wall -Wstrict-prototypes -c -o video.o video.c

bfin-uclinux-gcc -g  -Os   -ffixed-P5 -fomit-frame-pointer -mcpu=bf537-0.2 -D__KERNEL__ -I/home/test/work/cruise/checkouts/u-boot/u-boot-1.1.6/include -fno-builtin -ffreestanding -nostdinc -isystem /opt/uClinux/bfin-uclinux/bin/../lib/gcc/bfin-uclinux/4.1.2/include -pipe  -DCONFIG_BLACKFIN -Wall -Wstrict-prototypes -c -o i2c.o i2c.c

bfin-uclinux-gcc -g  -Os   -ffixed-P5 -fomit-frame-pointer -mcpu=bf537-0.2 -D__KERNEL__ -I/home/test/work/cruise/checkouts/u-boot/u-boot-1.1.6/include -fno-builtin -ffreestanding -nostdinc -isystem /opt/uClinux/bfin-uclinux/bin/../lib/gcc/bfin-uclinux/4.1.2/include -pipe  -DCONFIG_BLACKFIN -Wall -Wstrict-prototypes -c -o watchdog.o watchdog.c

bfin-uclinux-gcc -g  -Os   -ffixed-P5 -fomit-frame-pointer -mcpu=bf537-0.2 -D__KERNEL__ -I/home/test/work/cruise/checkouts/u-boot/u-boot-1.1.6/include -fno-builtin -ffreestanding -nostdinc -isystem /opt/uClinux/bfin-uclinux/bin/../lib/gcc/bfin-uclinux/4.1.2/include -pipe  -DCONFIG_BLACKFIN -Wall -Wstrict-prototypes -c -o initcode.o initcode.c

initcode.c:218: error: expected 鈥�鈥�before 鈥�鈥�token

make[1]: *** [initcode.o] Error 1

make[1]: Leaving directory `/home/test/work/cruise/checkouts/u-boot/u-boot-1.1.6/cpu/blackfin'

make: *** [cpu/blackfin/libblackfin.a] Error 2

 

Follow-ups

 

--- Mike Frysinger                                           2008-01-04 14:00:41

should be fixed now

 

--- Mingquan Pan                                             2008-01-06 22:02:36

Yes,close.

 

 

 

    Files

    Changes

    Commits

    Dependencies

    Duplicates

    Associations

    Tags

 

File Name     File Type     File Size     Posted By

No Files Were Found

Attachments

    Outcomes