[#7379] Fail to build alsa lib in latest trunk with upgraded toolchain

Document created by Aaronwu Employee on Sep 12, 2013
Version 1Show Document
  • View in full screen mode

[#7379] Fail to build alsa lib in latest trunk with upgraded toolchain

Submitted By: Vivi Li

Open Date

2012-09-27 05:57:47    

Priority:

Medium     Assignee:

Nobody

Status:

Open     Fixed In Release:

N/A

Found In Release:

N/A     Release:

Category:

N/A     Board:

N/A

Processor:

ALL     Silicon Revision:

Is this bug repeatable?:

Yes     Resolution:

Duplicate

Uboot version or rev.:

    Toolchain version or rev.:

gcc4.3-2012_Sep_25

App binary format:

N/A     

Summary: Fail to build alsa lib in latest trunk with upgraded toolchain

Details:

 

Fail to build alsa lib in latest trunk with upgraded toolchain.

It fails since last upgrade of toolchain on Sep 11.

 

--

/bin/sh ../../libtool --silent --tag=CC   --mode=compile bfin-linux-uclibc-gcc -DHAVE_CONFIG_H -I. -I/home/test/work/cruise/checkouts/uclinux-dist/lib/alsa-lib/alsa-lib-1.0.24/src/ucm -I../../include -I/home/test/work/cruise/checkouts/uclinux-dist/lib/alsa-lib/alsa-lib-1.0.24/include  -DEMBED -D__uClinux__ -I/home/test/work/cruise/checkouts/uclinux-dist  -mcpu=bf537-0.2  -pipe -Wall -g -O2      -mcpu=bf537-0.2 -lm -D_GNU_SOURCE -c -o parser.lo /home/test/work/cruise/checkouts/uclinux-dist/lib/alsa-lib/alsa-lib-1.0.24/src/ucm/parser.c

/home/test/work/cruise/checkouts/uclinux-dist/lib/alsa-lib/alsa-lib-1.0.24/src/ucm/parser.c:1205: error: conflicting types for 'versionsort'

/opt/uClinux.2012_Sep_25_15_31/bfin-linux-uclibc/bin/../bfin-linux-uclibc/runtime/usr/include/dirent.h:340: error: previous declaration of 'versionsort' was here

/home/test/work/cruise/checkouts/uclinux-dist/lib/alsa-lib/alsa-lib-1.0.24/src/ucm/parser.c: In function 'uc_mgr_scan_master_configs':

/home/test/work/cruise/checkouts/uclinux-dist/lib/alsa-lib/alsa-lib-1.0.24/src/ucm/parser.c:1226: warning: passing argument 4 of 'scandir' from incompatible pointer type

make[6]: *** [parser.lo] Error 1

make[6]: Leaving directory `/home/test/work/cruise/checkouts/uclinux-dist/lib/alsa-lib/build-alsa-lib-1.0.24/src/ucm'

--

 

Follow-ups

 

--- Vivi Li                                                  2012-09-27 07:02:48

Dup of bug 7334.

 

 

 

    Files

    Changes

    Commits

    Dependencies

    Duplicates

    Associations

    Tags

 

File Name     File Type     File Size     Posted By

No Files Were Found

Attachments

    Outcomes