[#7314] build bfinppi fails at bfin_ppi.c

Document created by Aaronwu Employee on Sep 12, 2013
Version 1Show Document
  • View in full screen mode

[#7314] build bfinppi fails at bfin_ppi.c

Submitted By: Mingquan Pan

Open Date

2012-09-06 22:42:05     Close Date

2012-09-13 22:46:27

Priority:

Medium     Assignee:

Scott Jiang

Status:

Closed     Fixed In Release:

N/A

Found In Release:

N/A     Release:

Category:

N/A     Board:

N/A

Processor:

BF548     Silicon Revision:

Is this bug repeatable?:

Yes     Resolution:

Rejected

Uboot version or rev.:

    Toolchain version or rev.:

ADI-2011R1-RC2

App binary format:

N/A     

Summary: build bfinppi fails at bfin_ppi.c

Details:

 

build bfinppi fails at bfin_ppi.c.

 

rm -f linux-2.6.x/usr/initramfs_data.cpio^M

make ARCH=blackfin   CROSS_COMPILE=bfin-uclinux- -j4 -C linux-2.6.x  || exit 1^M

make[1]: Entering directory `/home/test/work/cruise/checkouts/uclinux-dist/linux-2.6.x'^M

scripts/kconfig/conf --silentoldconfig Kconfig^M

drivers/net/dsa/Kconfig:4:warning: type of 'NET_DSA_MV88E6XXX' redefined from 'boolean' to 'tristate'^M

drivers/net/dsa/Kconfig:8:warning: type of 'NET_DSA_MV88E6060' redefined from 'boolean' to 'tristate'^M

drivers/net/dsa/Kconfig:19:warning: type of 'NET_DSA_MV88E6131' redefined from 'boolean' to 'tristate'^M

drivers/net/dsa/Kconfig:28:warning: type of 'NET_DSA_MV88E6123_61_65' redefined from 'boolean' to 'tristate'^M

make[1]: Leaving directory `/home/test/work/cruise/checkouts/uclinux-dist/linux-2.6.x'^M

make[1]: Entering directory `/home/test/work/cruise/checkouts/uclinux-dist/linux-2.6.x'^M

  CHK     include/linux/version.h^M

  CHK     include/generated/utsrelease.h^M

  CALL    scripts/checksyscalls.sh^M

  GEN     usr/initramfs_data.cpio^M

  AS      usr/initramfs_data.o^M

  CC      arch/blackfin/kernel/sys_bfin.o^M

  CHK     include/generated/compile.h^M

  CC      arch/blackfin/mach-bf548/boards/ezkit.o^M

  LD      usr/built-in.o^M

  CC      arch/blackfin/kernel/gptimers.o^M

  CC      arch/blackfin/kernel/early_printk.o^M

  LD      arch/blackfin/mach-bf548/boards/built-in.o^M

  GZIP    kernel/config_data.gz^M

  CHK     kernel/config_data.h^M

  UPD     kernel/config_data.h^M

  CC      kernel/configs.o^M

  LD      kernel/built-in.o^M

  LD      arch/blackfin/kernel/built-in.o^M

  CC      drivers/char/bfin_ppi.o^M

drivers/char/bfin_ppi.c: In function ‘compute_data_len’:^M

drivers/char/bfin_ppi.c:213: error: ‘CFG_PPI_DATALEN_11’ undeclared (first use in this function)^M

drivers/char/bfin_ppi.c:213: error: (Each undeclared identifier is reported only once^M

drivers/char/bfin_ppi.c:213: error: for each function it appears in.)^M

drivers/char/bfin_ppi.c:219: error: ‘CFG_PPI_DATALEN_13’ undeclared (first use in this function)^M

drivers/char/bfin_ppi.c:225: error: ‘CFG_PPI_DATALEN_15’ undeclared (first use in this function)^M

make[3]: *** [drivers/char/bfin_ppi.o] Error 1^M

make[2]: *** [drivers/char] Error 2^M

make[1]: *** [drivers] Error 2^M

make[1]: *** Waiting for unfinished jobs....^M

make[1]: Leaving directory `/home/test/work/cruise/checkouts/uclinux-dist/linux-2.6.x'^M

 

Follow-ups

 

--- Scott Jiang                                              2012-09-07 02:13:01

This driver is not for bf548.

 

--- Mingquan Pan                                             2012-09-13 23:45:52

Not test on bf548 ezkit now.

 

 

 

    Files

    Changes

    Commits

    Dependencies

    Duplicates

    Associations

    Tags

 

File Name     File Type     File Size     Posted By

No Files Were Found

Attachments

    Outcomes