[#7221] buld mcapi kernel on trunk head for bf561-ezkit fails

Document created by Aaronwu Employee on Sep 12, 2013
Version 1Show Document
  • View in full screen mode

[#7221] buld mcapi kernel on trunk head for bf561-ezkit fails

Submitted By: Mingquan Pan

Open Date

2012-07-31 05:10:25     Close Date

2012-08-07 05:19:05

Priority:

Medium     Assignee:

steven miao

Status:

Closed     Fixed In Release:

N/A

Found In Release:

N/A     Release:

Category:

N/A     Board:

N/A

Processor:

BF561     Silicon Revision:

Is this bug repeatable?:

Yes     Resolution:

Fixed

Uboot version or rev.:

    Toolchain version or rev.:

ADI-trunk/svn-5764

App binary format:

N/A     

Summary: buld mcapi kernel on trunk head for bf561-ezkit fails

Details:

 

buld mcapi kernel on trunk head  for bf561-ezkit fails  now.

 

make[7]: Entering directory `/home/test/work/cruise/checkouts/uclinux-dist/user/blkfin-apps/icc_utils/libmcapi_coreb/build-libmcapi-2.0'^M

test -z "/usr/lib" || /bin/mkdir -p "/home/test/work/cruise/checkouts/uclinux-dist/staging/usr/lib"^M

/bin/sh ./libtool   --mode=install /usr/bin/install -c  'libmcapi_coreb.la' '/home/test/work/cruise/checkouts/uclinux-dist/staging/usr/lib/libmcapi_coreb.la'^M

In file included from corebboot.c:19:^M

/home/test/work/cruise/checkouts/uclinux-dist/user/blkfin-apps/icc_utils/icc_core/../../../../linux-2.6.x/arch/blackfin/include/asm/blackfin.h:17: warning: conflicting types for ‘SSYNC’^M

/home/test/work/cruise/checkouts/uclinux-dist/user/blkfin-apps/icc_utils/icc_core/../../../../linux-2.6.x/arch/blackfin/include/asm/blackfin.h:17: error: static declaration of ‘SSYNC’ follows non-static declaration^M

/home/test/work/cruise/checkouts/uclinux-dist/user/blkfin-apps/icc_utils/icc_core/../../../../linux-2.6.x/arch/blackfin/include/asm/cplb.h:124: error: previous implicit declaration of ‘SSYNC’ was here^M

/home/test/work/cruise/checkouts/uclinux-dist/user/blkfin-apps/icc_utils/icc_core/../../../../linux-2.6.x/arch/blackfin/include/asm/blackfin.h:35: warning: conflicting types for ‘CSYNC’^M

/home/test/work/cruise/checkouts/uclinux-dist/user/blkfin-apps/icc_utils/icc_core/../../../../linux-2.6.x/arch/blackfin/include/asm/blackfin.h:35: error: static declaration of ‘CSYNC’ follows non-static declaration^M

/home/test/work/cruise/checkouts/uclinux-dist/user/blkfin-apps/icc_utils/icc_core/../../../../linux-2.6.x/arch/blackfin/include/asm/cplb.h:122: error: previous implicit declaration of ‘CSYNC’ was here^M

/usr/bin/install -c .libs/libmcapi_coreb.lai /home/test/work/cruise/checkouts/uclinux-dist/staging/usr/lib/libmcapi_coreb.la^M

corebboot.c: In function ‘coreb_dump_stack’:^M

corebboot.c:115: warning: assignment makes pointer from integer without a cast^M

corebboot.c:117: warning: comparison of distinct pointer types lacks a cast^M

corebboot.c:125: warning: comparison of distinct pointer types lacks a cast^M

corebboot.c:143: warning: comparison of distinct pointer types lacks a cast^M

corebboot.c:162: warning: assignment makes pointer from integer without a cast^M

corebboot.c: In function ‘coreb_msg’:^M

corebboot.c:318: warning: assignment makes integer from pointer without a cast^M

corebboot.c: At top level:^M

corebboot.c:112: warning: ‘readipend’ declared inline after being called^M

corebboot.c:112: warning: previous implicit declaration of ‘readipend’ was here^M

corebboot.c: In function ‘icc_init’:^M

corebboot.c:500: warning: passing argument 1 of ‘memset’ makes pointer from integer without a cast^M

protocol.c: In function ‘sm_index_to_session’:^M

protocol.c:148: warning: passing argument 2 of ‘test_bit’ from incompatible pointer type^M

make[5]: *** [corebboot.o] Error 1^M

make[5]: *** Waiting for unfinished jobs....^M

test -z "/usr/include/mcapi-2.0_coreb" || /bin/mkdir -p "/home/test/work/cruise/checkouts/uclinux-dist/staging/usr/include/mcapi-2.0_coreb"^M

protocol.c: In function ‘sm_alloc_session’:^M

protocol.c:179: warning: passing argument 1 of ‘find_next_zero_bit’ from incompati

 

Follow-ups

 

--- steven miao                                              2012-08-03 03:03:24

reorder include file

 

--- Mingquan Pan                                             2012-08-07 06:18:01

Yes, builds ok now.

 

Close.

 

 

 

    Files

    Changes

    Commits

    Dependencies

    Duplicates

    Associations

    Tags

 

File Name     File Type     File Size     Posted By

No Files Were Found

Attachments

    Outcomes