FAQ: [#7111] Build kernel fails at debug-mmrs.c with bfin_twi.h error(2012)

Document created by Aaronwu Employee on Sep 12, 2013
Version 1Show Document
  • View in full screen mode

[#7111] Build kernel fails at debug-mmrs.c with bfin_twi.h error

Submitted By: Vivi Li

Open Date

2012-05-17 03:09:18     Close Date

2012-05-17 03:10:09

Priority:

Medium     Assignee:

Nobody

Status:

Closed     Fixed In Release:

N/A

Found In Release:

N/A     Release:

Category:

Make Errors     Board:

N/A

Processor:

ALL     Silicon Revision:

Is this bug repeatable?:

Yes     Resolution:

Out of Date

Uboot version or rev.:

    Toolchain version or rev.:

gcc4.3-2012_Feb_15

App binary format:

N/A     

Summary: Build kernel fails at debug-mmrs.c with bfin_twi.h error

Details:

 

Build kernel fails at debug-mmrs.c with bfin_twi.h error.

 

--

  CC      arch/blackfin/kernel/debug-mmrs.o

In file included from arch/blackfin/kernel/debug-mmrs.c:22:

/home/test/work/cruise/checkouts/uclinux-dist/linux-2.6.x/arch/blackfin/include/asm/bfin_twi.h:56: error: field ‘adap’ has inlete type

In file included from arch/blackfin/kernel/debug-mmrs.c:22:

/home/test/work/cruise/checkouts/uclinux-dist/linux-2.6.x/arch/blackfin/include/asm/bfin_twi.h:86:6: warning: "ANOMALY_05001001" is not defined

make[2]: *** [arch/blackfin/kernel/debug-mmrs.o] Error 1

make[2]: *** Waiting for unfinished jobs....

make[1]: *** [arch/blackfin/kernel] Error 2

make[1]: *** Waiting for unfinished jobs....

--

 

Follow-ups

 

--- Vivi Li                                                  2012-05-17 04:10:17

Out of date now. Close it.

 

 

 

    Files

    Changes

    Commits

    Dependencies

    Duplicates

    Associations

    Tags

 

File Name     File Type     File Size     Posted By

No Files Were Found

Attachments

    Outcomes