FAQ: [#7074] build awg kernel stops at bfin_sport.c(2012)

Document created by Aaronwu Employee on Sep 12, 2013
Version 1Show Document
  • View in full screen mode

[#7074] build awg kernel stops at bfin_sport.c

Submitted By: Mingquan Pan

Open Date

2012-04-26 22:38:44     Close Date

2012-05-14 04:48:05

Priority:

Medium     Assignee:

Aaron Wu

Status:

Closed     Fixed In Release:

N/A

Found In Release:

N/A     Release:

Category:

N/A     Board:

N/A

Processor:

BF537     Silicon Revision:

Is this bug repeatable?:

Yes     Resolution:

Fixed

Uboot version or rev.:

    Toolchain version or rev.:

ADI-trunk/svn-5764

App binary format:

N/A     

Summary: build awg kernel stops at bfin_sport.c

Details:

 

build awg kernel stops at bfin_sport.c.

 

  LD      usr/built-in.o^M

  CC      arch/blackfin/mach-bf537/boards/stamp.o^M

  LD      arch/blackfin/mach-bf537/boards/built-in.o^M

  GZIP    kernel/config_data.gz^M

  CHK     kernel/config_data.h^M

  UPD     kernel/config_data.h^M

  CC      kernel/configs.o^M

  LD      kernel/built-in.o^M

  CC      drivers/char/bfin_sport.o^M

drivers/char/bfin_sport.c: In function ‘sport_configure’:^M

drivers/char/bfin_sport.c:692: error: called object ‘"<3>"’ is not a function^M

drivers/char/bfin_sport.c:700: error: called object ‘"<3>"’ is not a function^M

drivers/char/bfin_sport.c: In function ‘bfin_sport_probe’:^M

drivers/char/bfin_sport.c:856: warning: format ‘%x’ expects type ‘unsigned int’, but argument 2 has type ‘struct miscdevice *’^M

make[3]: *** [drivers/char/bfin_sport.o] Error 1^M

make[2]: *** [drivers/char] Error 2^M

make[1]: *** [drivers] Error 2^M

make[1]: *** Waiting for unfinished jobs....^M

 

Follow-ups

 

--- Aaron Wu                                                 2012-05-04 05:11:26

delet the redundant macro

 

--- Mingquan Pan                                             2012-05-14 05:47:56

It builds ok now. Close.

 

 

 

    Files

    Changes

    Commits

    Dependencies

    Duplicates

    Associations

    Tags

 

File Name     File Type     File Size     Posted By

No Files Were Found

Attachments

    Outcomes