FAQ:[#7069] ICC: fail to build icc kernel in bf561 in trunk(2012)

Document created by Aaronwu Employee on Sep 12, 2013
Version 1Show Document
  • View in full screen mode

[#7069] ICC: fail to build icc kernel in bf561 in trunk

Submitted By: Vivi Li

Open Date

2012-04-20 02:02:10     Close Date

2012-04-28 05:28:28

Priority:

Medium     Assignee:

steven miao

Status:

Closed     Fixed In Release:

N/A

Found In Release:

N/A     Release:

Category:

N/A     Board:

EZKIT Lite

Processor:

BF561     Silicon Revision:

Is this bug repeatable?:

Yes     Resolution:

Fixed

Uboot version or rev.:

    Toolchain version or rev.:

gcc4.3-2012_Feb_15

App binary format:

N/A     

Summary: ICC: fail to build icc kernel in bf561 in trunk

Details:

 

Fail to build icc kernel on bf561-ezkit in trunk.

 

First failed time: 2012_Mar_15_14_34

--

kernel:    Linux release 3.2.0-ADI-2012R1-pre-00347-g9e8145c, build #186 Thu Mar 15 21:08:53 CST 2012

toolchain: bfin-uclinux-gcc release gcc version 4.3.5 (ADI-trunk/svn-5764)

user-dist: release svn-10652, build #2123 Thu Mar 15 21:07:53 CST 2012

--

 

Last passed version: 2012_Mar_13_00_29

--

kernel:    Linux release 3.2.0-ADI-2012R1-pre-00342-g3ef373c, build #180 Tue Mar 13 07:02:23 CST 2012

toolchain: bfin-uclinux-gcc release gcc version 4.3.5 (ADI-trunk/svn-5764)

user-dist: release svn-10648, build #2053 Tue Mar 13 07:01:21 CST 2012

--

 

 

Bellow is the error log:

--

  CC      drivers/staging/icc/core/protocol.o

drivers/staging/icc/core/protocol.c: In function ‘sm_send_message_internal’:

drivers/staging/icc/core/protocol.c:228: error: ‘IRQ_SUPPLE_0’ undeclared (first use in this function)

drivers/staging/icc/core/protocol.c:228: error: (Each undeclared identifier is reported only once

drivers/staging/icc/core/protocol.c:228: error: for each function it appears in.)

drivers/staging/icc/core/protocol.c: In function ‘icc_release’:

drivers/staging/icc/core/protocol.c:816: warning: unused variable ‘used’

make[4]: *** [drivers/staging/icc/core/protocol.o] Error 1

make[3]: *** [drivers/staging/icc] Error 2

make[2]: *** [drivers/staging] Error 2

make[1]: *** [drivers] Error 2

make[1]: *** Waiting for unfinished jobs....

--

 

Follow-ups

 

--- steven miao                                              2012-04-25 04:45:10

include missing irq.h

 

--- Vivi Li                                                  2012-04-28 06:24:03

OK, close it.

 

 

 

    Files

    Changes

    Commits

    Dependencies

    Duplicates

    Associations

    Tags

 

File Name     File Type     File Size     Posted By

No Files Were Found

Attachments

    Outcomes