FAQ: [#7068] SMP: Fail to build smp kernel after kernel upgrade to 3.3.(2012)

Document created by Aaronwu Employee on Sep 12, 2013
Version 1Show Document
  • View in full screen mode

[#7068] SMP: Fail to build smp kernel after kernel upgrade to 3.3.

Submitted By: Vivi Li

Open Date

2012-04-20 01:49:49     Close Date

2012-04-27 02:07:59

Priority:

Medium     Assignee:

steven miao

Status:

Closed     Fixed In Release:

N/A

Found In Release:

N/A     Release:

Category:

N/A     Board:

EZKIT Lite

Processor:

BF561     Silicon Revision:

Is this bug repeatable?:

Yes     Resolution:

Fixed

Uboot version or rev.:

    Toolchain version or rev.:

gcc4.3-2012_Feb_15

App binary format:

N/A     

Summary: SMP: Fail to build smp kernel after kernel upgrade to 3.3.

Details:

 

Fail to build smp kernel after kernel upgrade to 3.3.

 

--

  CC      arch/blackfin/mach-common/smp.o

arch/blackfin/mach-common/smp.c:174: error: redefinition of ‘ipi_timer’

arch/blackfin/mach-common/smp.c:167: error: previous definition of ‘ipi_timer’ was here

arch/blackfin/mach-common/smp.c:336: error: redefinition of ‘smp_send_msg’

arch/blackfin/mach-common/smp.c:327: error: previous definition of ‘smp_send_msg’ was here

arch/blackfin/mach-common/smp.c:341: error: redefinition of ‘smp_timer_broadcast’

arch/blackfin/mach-common/smp.c:332: error: previous definition of ‘smp_timer_broadcast’ was here

make[2]: *** [arch/blackfin/mach-common/smp.o] Error 1

make[1]: *** [arch/blackfin/mach-common] Error 2

make[1]: *** Waiting for unfinished jobs....

--

 

Follow-ups

 

--- steven miao                                              2012-04-25 03:57:07

drop duplicated smp patch

 

--- Vivi Li                                                  2012-04-27 03:03:15

OK, it can build now.

 

 

 

    Files

    Changes

    Commits

    Dependencies

    Duplicates

    Associations

    Tags

 

File Name     File Type     File Size     Posted By

No Files Were Found

Attachments

    Outcomes