FAQ: [#6947] build kdb kernel fails on trunk at kgdboe.c(2012)

Document created by Aaronwu Employee on Sep 12, 2013Last modified by Aaronwu Employee on Sep 12, 2013
Version 2Show Document
  • View in full screen mode

[#6947] build kdb kernel fails on trunk at kgdboe.c

Submitted By: Mingquan Pan

Open Date

2012-01-12 01:32:09     Close Date

2012-01-17 01:07:48

Priority:

Medium     Assignee:

Nobody

Status:

Closed     Fixed In Release:

N/A

Found In Release:

N/A     Release:

Category:

N/A     Board:

N/A

Processor:

ALL     Silicon Revision:

Is this bug repeatable?:

Yes     Resolution:

Duplicate

Uboot version or rev.:

    Toolchain version or rev.:

2011r1-rc4

App binary format:

N/A     

Summary: build kdb kernel fails on trunk at kgdboe.c

Details:

 

build kdb kernel fails on trunk at kgdboe. c.

 

  CC      net/socket.o^M

  LD      drivers/net/phy/libphy.o^M

  LD      drivers/net/phy/built-in.o^M

  CC      drivers/net/bfin_mac.o^M

  CC      drivers/net/netconsole.o^M

  CC [M]  fs/nfs/inode.o^M

  CC      lib/bcd.o^M

  CC      drivers/net/kgdboe.o^M

  CC      lib/div64.o^M

  CC [M]  net/can/bcm.o^M

  CC      lib/sort.o^M

drivers/net/kgdboe.c: In function ‘eth_get_char’:^M

drivers/net/kgdboe.c:124: error: implicit declaration of function ‘netpoll_poll’^M

make[3]: *** [drivers/net/kgdboe.o] Error 1^M

make[2]: *** [drivers/net] Error 2^M

make[1]: *** [drivers] Error 2^M

make[1]: *** Waiting for unfinished jobs....^M

  CC [M]  net/can/raw.o^M

  CC      lib/parser.o^M

 

Follow-ups

 

--- Vivi Li                                                  2012-01-17 01:36:29

Bug 6850 is fixed and closed.

 

 

 

    Files

    Changes

    Commits

    Dependencies

    Duplicates

    Associations

    Tags

 

File Name     File Type     File Size     Posted By

No Files Were Found

Attachments

    Outcomes