FAQ: [#6340] Strace fails to build in trunk with linux-2.6.36(2010)

Document created by Aaronwu Employee on Sep 11, 2013
Version 1Show Document
  • View in full screen mode

[#6340] Strace fails to build in trunk with linux-2.6.36

Submitted By: Cameron Barfield

Open Date

2010-11-12 13:42:06    

Priority:

Medium     Assignee:

Nobody

Status:

Open     Fixed In Release:

N/A

Found In Release:

snaps     Release:

Distro trunk commit e12dab9975

Category:

Make Errors     Board:

N/A

Processor:

ALL     Silicon Revision:

Is this bug repeatable?:

Yes     Resolution:

Fixed

Uboot version or rev.:

    Toolchain version or rev.:

cp,,ot 1378d9b11

App binary format:

N/A     

Summary: Strace fails to build in trunk with linux-2.6.36

Details:

 

Strace: bfin in strace-4.5.20

Kernel: blackfin in /home/cameron/src/blackfin/svn/uClinux-dist.2009/linux-2.6.x

errno list ... OK!

ioctl list ... FAIL! (see /home/cameron/src/blackfin/svn/uClinux-dist.2009/user/strace/strace-4.5.20/ioctlent.h)

signal list ... OK!

syscall list ... OK!

make[3]: *** [.check] Error 1

make[3]: Leaving directory `/home/cameron/src/blackfin/svn/uClinux-dist.2009/user/strace'

make[2]: *** [strace] Error 2

make[2]: Leaving directory `/home/cameron/src/blackfin/svn/uClinux-dist.2009/user'

make[1]: *** [all] Error 2

make[1]: Leaving directory `/home/cameron/src/blackfin/svn/uClinux-dist.2009/user'

make: *** [subdirs] Error 1

 

Follow-ups

 

--- Cameron Barfield                                         2010-11-12 13:48:39

Whoops. Sorry for the dupe. I didn't search back far enough.

 

--- Mike Frysinger                                           2010-11-13 01:54:33

trunk has been updated now

 

 

 

    Files

    Changes

    Commits

    Dependencies

    Duplicates

    Associations

    Tags

 

File Name     File Type     File Size     Posted By

bugreport.tar.gz    application/gzip    20319    Cameron Barfield

Attachments

Outcomes