[#6335] Build xip failed in fdpic format when xenomai is enabled

Document created by Aaronwu Employee on Sep 11, 2013
Version 1Show Document
  • View in full screen mode

[#6335] Build xip failed in fdpic format when xenomai is enabled

Submitted By: Vivi Li

Open Date

2010-11-09 07:20:32     Close Date

2010-11-12 02:23:35

Priority:

Medium     Assignee:

steven miao

Status:

Closed     Fixed In Release:

N/A

Found In Release:

2010R1     Release:

Category:

N/A     Board:

N/A

Processor:

BF537     Silicon Revision:

Is this bug repeatable?:

Yes     Resolution:

Out of Date

Uboot version or rev.:

    Toolchain version or rev.:

2010r1-rc4

App binary format:

N/A     

Summary: Build xip failed in fdpic format when xenomai is enabled

Details:

 

Build xip failed in fdpic format when xenomai is enabled.

 

Bellow is the error log:

--

make[2]: Leaving directory `/home/test/work/cruise/checkouts/uclinux-dist/user/portmap'

make[2]: Entering directory `/home/test/work/cruise/checkouts/uclinux-dist/user/sysutils'

romfs-inst.sh -e CONFIG_USER_SYSUTILS_DF       /bin/df

romfs-inst.sh -e CONFIG_USER_SYSUTILS_FREE     /bin/free

romfs-inst.sh -e CONFIG_USER_SYSUTILS_HOSTNAME /bin/hostname

romfs-inst.sh -e CONFIG_USER_SYSUTILS_KILL     /bin/kill

romfs-inst.sh -e CONFIG_USER_SYSUTILS_PS       /bin/ps

romfs-inst.sh -e CONFIG_USER_SYSUTILS_REBOOT   /bin/reboot

romfs-inst.sh -e CONFIG_USER_SYSUTILS_SHUTDOWN /bin/shutdown

make[2]: Leaving directory `/home/test/work/cruise/checkouts/uclinux-dist/user/sysutils'

make[2]: Entering directory `/home/test/work/cruise/checkouts/uclinux-dist/user/telnetd'

romfs-inst.sh /bin/telnetd

romfs-inst.sh -e CONFIG_USER_TELNETD_TELNETD \

                -a "telnet  stream tcp nowait root /bin/telnetd" /etc/inetd.conf

make[2]: Leaving directory `/home/test/work/cruise/checkouts/uclinux-dist/user/telnetd'

make[2]: Entering directory `/home/test/work/cruise/checkouts/uclinux-dist/user/version'

romfs-inst.sh /bin/version

make[2]: Leaving directory `/home/test/work/cruise/checkouts/uclinux-dist/user/version'

make[2]: Entering directory `/home/test/work/cruise/checkouts/uclinux-dist/user/xenomai'

romfs-inst.sh -d /home/test/work/cruise/checkouts/uclinux-dist/staging/usr/bin/latency /usr/bin/latency

romfs-inst.sh -d /home/test/work/cruise/checkouts/uclinux-dist/staging/usr/bin/switchtest /usr/bin/switchtest

romfs-inst.sh -d /home/test/work/cruise/checkouts/uclinux-dist/staging/usr/bin/clocktest /usr/bin/clocktest

romfs-inst.sh -d /home/test/work/cruise/checkouts/uclinux-dist/staging/usr/bin/cyclictest /usr/bin/cyclictest

romfs-inst.sh -d /home/test/work/cruise/checkouts/uclinux-dist/staging/usr/bin/irqloop /usr/bin/irqloop

romfs-inst.sh -d /home/test/work/cruise/checkouts/uclinux-dist/staging/usr/bin/klatency /usr/bin/klatency

romfs-inst.sh -e CONFIG_FMT_USE_FDPIC_ELF -d /home/test/work/cruise/checkouts/uclinux-dist/staging/usr/lib/libnative.so /usr/lib/libnative.so

cp: cannot stat `/home/test/work/cruise/checkouts/uclinux-dist/staging/usr/lib/libnative.so': No such file or directory

make[2]: *** [romfs] Error 1

make[2]: Leaving directory `/home/test/work/cruise/checkouts/uclinux-dist/user/xenomai'

make[1]: *** [romfs] Error 2

make[1]: Leaving directory `/home/test/work/cruise/checkouts/uclinux-dist/user'

make: *** [romfs.subdirs] Error 1

--

 

Follow-ups

 

--- Vivi Li                                                  2010-11-12 02:23:35

Out of date now, close it.

 

 

 

    Files

    Changes

    Commits

    Dependencies

    Duplicates

    Associations

    Tags

 

File Name     File Type     File Size     Posted By

config.linux.fs_xip.fdpic    application/octet-stream    24125    Vivi Li

config.config.fs_xip.fdpic    application/octet-stream    46237    Vivi Li

Outcomes