FAQ: [#5952] Build latest kernel fail at bfin_can.c(2010)

Document created by Aaronwu Employee on Sep 10, 2013
Version 1Show Document
  • View in full screen mode

[#5952] Build latest kernel fail at bfin_can.c

Submitted By: Mingquan Pan

Open Date

2010-03-07 23:47:31     Close Date

2010-03-07 23:51:52

Priority:

Medium     Assignee:

Nobody

Status:

Closed     Fixed In Release:

N/A

Found In Release:

2010R1     Release:

Category:

N/A     Board:

N/A

Processor:

ALL     Silicon Revision:

Is this bug repeatable?:

Yes     Resolution:

Duplicate

Uboot version or rev.:

    Toolchain version or rev.:

trunk head 4.3

App binary format:

N/A     

Summary: Build latest kernel fail at bfin_can.c

Details:

 

Build latest kernel fail at bfin_can.c.

 

  LD      drivers/net/can/usb/built-in.o^M

  LD      sound/soc/au1x/built-in.o^M

  CC [M]  drivers/net/can/dev.o^M

  LD      sound/soc/blackfin/built-in.o^M

  CC      net/core/skbuff.o^M

  CC [M]  sound/soc/blackfin/bf5xx-ad1980.o^M

  CC [M]  fs/nfs/namespace.o^M

  CC [M]  sound/soc/blackfin/bf5xx-ad73311.o^M

  CC [M]  drivers/net/can/bfin_can.o^M

drivers/net/can/bfin_can.c: In function ‘alloc_bfin_candev’:^M

drivers/net/can/bfin_can.c:510: error: too few arguments to function ‘alloc_candev’^M

make[4]: *** [drivers/net/can/bfin_can.o] Error 1^M

make[3]: *** [drivers/net/can] Error 2^M

make[2]: *** [drivers/net] Error 2^M

make[1]: *** [drivers] Error 2^M

make[1]: *** Waiting for unfinished jobs....^M

 

Follow-ups

 

--- Mike Frysinger                                           2010-03-07 23:50:50

dupe of [#5939]

 

 

 

    Files

    Changes

    Commits

    Dependencies

    Duplicates

    Associations

    Tags

 

File Name     File Type     File Size     Posted By

No Files Were Found

Attachments

    Outcomes