[#5839] Build kernel fails at time-ts.c for latest trunk

Document created by Aaronwu Employee on Sep 10, 2013
Version 1Show Document
  • View in full screen mode

[#5839] Build kernel fails at time-ts.c for latest trunk

Submitted By: Vivi Li

Open Date

2010-01-20 22:54:58     Close Date

2010-01-20 22:56:50

Priority:

Medium     Assignee:

Nobody

Status:

Closed     Fixed In Release:

N/A

Found In Release:

2010R1     Release:

Category:

Make Errors     Board:

N/A

Processor:

ALL     Silicon Revision:

Is this bug repeatable?:

Yes     Resolution:

Out of Date

Uboot version or rev.:

    Toolchain version or rev.:

gcc4.3_trunk3771

App binary format:

N/A     

Summary: Build kernel fails at time-ts.c for latest trunk

Details:

 

Build kernel fails at time-ts.c for latest trunk.

 

--

  CC      arch/blackfin/kernel/time-ts.o

arch/blackfin/kernel/time-ts.c:24:21: error: asm/nmi.h: No such file or directory

arch/blackfin/kernel/time-ts.c: In function ‘bfin_coretmr_interrupt’:

arch/blackfin/kernel/time-ts.c:318: error: implicit declaration of function ‘check_nmi_watchdog’

make[2]: *** [arch/blackfin/kernel/time-ts.o] Error 1

--

 

Follow-ups

 

--- Vivi Li                                                  2010-01-20 22:56:34

Out of date.

Close it.

 

 

 

    Files

    Changes

    Commits

    Dependencies

    Duplicates

    Associations

    Tags

 

File Name     File Type     File Size     Posted By

No Files Were Found

Attachments

    Outcomes