[#5702] build xenomai into fdpic format fails for no libnative.so

Document created by Aaronwu Employee on Sep 5, 2013
Version 1Show Document
  • View in full screen mode

[#5702] build xenomai into fdpic format fails for no libnative.so

Submitted By: Mingquan Pan

Open Date

2009-11-18 23:04:07    

Priority:

Medium     Assignee:

Yi Li

Status:

Open     Fixed In Release:

N/A

Found In Release:

2010R1     Release:

Category:

N/A     Board:

N/A

Processor:

BF533     Silicon Revision:

Is this bug repeatable?:

Yes     Resolution:

Duplicate

Uboot version or rev.:

    Toolchain version or rev.:

4.3.4 (ADI-trunk/svn-3679)

App binary format:

N/A     

Summary: build xenomai into fdpic format fails for no libnative.so

Details:

 

build xenomai into fdpic format fails for no libnative.so.

 

make[2]: Entering directory `/home/test/work/cruise/checkouts/uclinux-dist/user/version'^M

romfs-inst.sh /bin/version^M

make[2]: Leaving directory `/home/test/work/cruise/checkouts/uclinux-dist/user/version'^M

make[2]: Entering directory `/home/test/work/cruise/checkouts/uclinux-dist/user/vplay'^M

romfs-inst.sh -e CONFIG_USER_VPLAY_VPLAY /bin/vplay^M

romfs-inst.sh -e CONFIG_USER_VPLAY_VREC  /bin/vrec^M

romfs-inst.sh -e CONFIG_USER_VPLAY_MIXER /bin/mixer^M

make[2]: Leaving directory `/home/test/work/cruise/checkouts/uclinux-dist/user/vplay'^M

make[2]: Entering directory `/home/test/work/cruise/checkouts/uclinux-dist/user/watchdogd'^M

romfs-inst.sh -e CONFIG_USER_WATCHDOGD /bin/watchdogd^M

romfs-inst.sh -e CONFIG_USER_WATCHDOGD -a "watchdogd:unknown:/bin/watchdogd -f -s" /etc/inittab^M

make[2]: Leaving directory `/home/test/work/cruise/checkouts/uclinux-dist/user/watchdogd'^M

make[2]: Entering directory `/home/test/work/cruise/checkouts/uclinux-dist/user/whetstone'^M

romfs-inst.sh /bin/whetstone^M

make[2]: Leaving directory `/home/test/work/cruise/checkouts/uclinux-dist/user/whetstone'^M

make[2]: Entering directory `/home/test/work/cruise/checkouts/uclinux-dist/user/xenomai'^M

romfs-inst.sh -d /home/test/work/cruise/checkouts/uclinux-dist/staging/usr/bin/latency /usr/bin/latency^M

romfs-inst.sh -d /home/test/work/cruise/checkouts/uclinux-dist/staging/usr/bin/switchtest /usr/bin/switchtest^M

romfs-inst.sh -d /home/test/work/cruise/checkouts/uclinux-dist/staging/usr/bin/clocktest /usr/bin/clocktest^M

romfs-inst.sh -d /home/test/work/cruise/checkouts/uclinux-dist/staging/usr/bin/cyclictest /usr/bin/cyclictest^M

romfs-inst.sh -d /home/test/work/cruise/checkouts/uclinux-dist/staging/usr/bin/irqloop /usr/bin/irqloop^M

romfs-inst.sh -d /home/test/work/cruise/checkouts/uclinux-dist/staging/usr/bin/klatency /usr/bin/klatency^M

romfs-inst.sh -e CONFIG_FMT_USE_FDPIC_ELF -d /home/test/work/cruise/checkouts/uclinux-dist/staging/usr/lib/libnative.so /usr/lib/libnative.so^M

cp: cannot stat `/home/test/work/cruise/checkouts/uclinux-dist/staging/usr/lib/libnative.so': No such file or directory^M

make[2]: *** [romfs] Error 1^M

make[2]: Leaving directory `/home/test/work/cruise/checkouts/uclinux-dist/user/xenomai'^M

make[1]: *** [romfs] Error 2^M

make[1]: Leaving directory `/home/test/work/cruise/checkouts/uclinux-dist/user'^M

make: *** [romfs.subdirs] Error 1^M

 

Follow-ups

 

--- Yi Li                                                    2009-12-22 02:04:25

Depends on bug #5753.

 

 

 

    Files

    Changes

    Commits

    Dependencies

    Duplicates

    Associations

    Tags

 

File Name     File Type     File Size     Posted By

No Files Were Found

Attachments

    Outcomes