[#5695] Build bf537-stamp fails at ad73322 for the latest trunk

Document created by Aaronwu Employee on Sep 5, 2013
Version 1Show Document
  • View in full screen mode

[#5695] Build bf537-stamp fails at ad73322 for the latest trunk

Submitted By: Vivi Li

Open Date

2009-11-18 02:19:56     Close Date

2009-11-19 04:49:53

Priority:

Medium     Assignee:

Cliff Cai

Status:

Closed     Fixed In Release:

N/A

Found In Release:

2010R1     Release:

Category:

Make Errors     Board:

N/A

Processor:

BF537     Silicon Revision:

Is this bug repeatable?:

Yes     Resolution:

Out of Date

Uboot version or rev.:

    Toolchain version or rev.:

svn trunk gcc4.3

App binary format:

N/A     

Summary: Build bf537-stamp fails at ad73322 for the latest trunk

Details:

 

Build bf537-stamp fails at ad73322 for the latest trunk.

 

--

  CC [M]  sound/blackfin/ad73322.o

sound/blackfin/ad73322.c: In function ‘snd_ad73322_configure’:^M

sound/blackfin/ad73322.c:750: error: ‘TFSR’ undeclared (first use in this function)^M

sound/blackfin/ad73322.c:750: error: (Each undeclared identifier is reported only once^M

sound/blackfin/ad73322.c:750: error: for each function it appears in.)^M

sound/blackfin/ad73322.c:757: error: ‘TSPEN’ undeclared (first use in this function)^M

sound/blackfin/ad73322.c:759: error: ‘TUVF’ undeclared (first use in this function)^M

sound/blackfin/ad73322.c: In function ‘snd_ad73322_probe’:^M

sound/blackfin/ad73322.c:909: error: ‘RFSR’ undeclared (first use in this function)^M

sound/blackfin/ad73322.c:910: error: ‘TFSR’ undeclared (first use in this function)^M

sound/blackfin/ad73322.c: In function ‘snd_ad73322_resume’:^M

sound/blackfin/ad73322.c:999: error: ‘RFSR’ undeclared (first use in this function)^M

sound/blackfin/ad73322.c:1000: error: ‘TFSR’ undeclared (first use in this function)^M

make[3]: *** [sound/blackfin/ad73322.o] Error 1^M

make[2]: *** [sound/blackfin] Error 2^M

make[1]: *** [sound] Error 2^M

make[1]: *** Waiting for unfinished jobs....

--

 

Follow-ups

 

--- Vivi Li                                                  2009-11-19 04:49:53

Disappear after latest check in audio driver. Out of date.

Close it.

 

 

 

    Files

    Changes

    Commits

    Dependencies

    Duplicates

    Associations

    Tags

 

File Name     File Type     File Size     Posted By

No Files Were Found

Attachments

    Outcomes