[#5683] build nand fails for format error

Document created by Aaronwu Employee on Sep 5, 2013
Version 1Show Document
  • View in full screen mode

[#5683] build nand fails for format error

Submitted By: Mingquan Pan

Open Date

2009-11-13 05:03:19     Close Date

2009-11-17 03:34:38

Priority:

Medium     Assignee:

Nobody

Status:

Closed     Fixed In Release:

N/A

Found In Release:

2010R1     Release:

Category:

N/A     Board:

N/A

Processor:

BF537     Silicon Revision:

Is this bug repeatable?:

Yes     Resolution:

Fixed

Uboot version or rev.:

    Toolchain version or rev.:

4.3.4 (ADI-trunk/svn-3679)

App binary format:

N/A     

Summary: build nand fails for format error

Details:

 

build nand fails for format error on trunk head.

 

make[1]: Entering directory `/home/test/work/cruise/checkouts/uclinux-dist/linux-2.6.x'^M

  CHK     include/linux/version.h^M

  CHK     include/linux/utsrelease.h^M

  SYMLINK include/asm -> include/asm-blackfin^M

  CALL    scripts/checksyscalls.sh^M

  CHK     include/linux/compile.h^M

  GEN     usr/initramfs_data.cpio^M

  AS      usr/initramfs_data.o^M

  LD      usr/built-in.o^M

  CC      arch/blackfin/mach-bf537/boards/stamp.o^M

arch/blackfin/mach-bf537/boards/stamp.c:430: error: braced-group within expression allowed only inside a function^M

make[2]: *** [arch/blackfin/mach-bf537/boards/stamp.o] Error 1^M

make[1]: *** [arch/blackfin/mach-bf537/boards] Error 2^M

make[1]: *** Waiting for unfinished jobs....^M

 

Follow-ups

 

--- Mike Frysinger                                           2009-11-14 21:54:19

should be fixed now by reverting the MAX() change

 

--- Mingquan Pan                                             2009-11-17 03:34:37

Yes,fixe,close.

 

 

 

    Files

    Changes

    Commits

    Dependencies

    Duplicates

    Associations

    Tags

 

File Name     File Type     File Size     Posted By

No Files Were Found

Attachments

    Outcomes