[#5676] mpu kernel fail to build on trunk

Document created by Aaronwu Employee on Sep 5, 2013
Version 1Show Document
  • View in full screen mode

[#5676] mpu kernel fail to build on trunk

Submitted By: Vivi Li

Open Date

2009-11-11 05:54:20     Close Date

2009-11-24 23:37:15

Priority:

Medium     Assignee:

Mike Frysinger

Status:

Closed     Fixed In Release:

N/A

Found In Release:

2010R1     Release:

Category:

Make Errors     Board:

N/A

Processor:

ALL     Silicon Revision:

Is this bug repeatable?:

Yes     Resolution:

Out of Date

Uboot version or rev.:

    Toolchain version or rev.:

svn trunk gcc4.3

App binary format:

N/A     

Summary: mpu kernel fail to build on trunk

Details:

 

mpu kernel fail to build on trunk since 2009_Oct_31.

 

--

  CC      arch/blackfin/kernel/cplb-mpu/cplbmgr.o

In file included from arch/blackfin/kernel/cplb-mpu/cplbmgr.c:16:

/home/test/work/cruise/checkouts/uclinux-dist/linux-2.6.x/arch/blackfin/include/asm/mmu_context.h: In function ‘switch_mm’:

/home/test/work/cruise/checkouts/uclinux-dist/linux-2.6.x/arch/blackfin/include/asm/mmu_context.h:103: error: implicit declaration of function ‘local_irq_save_hw_cond’

/home/test/work/cruise/checkouts/uclinux-dist/linux-2.6.x/arch/blackfin/include/asm/mmu_context.h:105: error: implicit declaration of function ‘local_irq_restore_hw_cond’

make[2]: *** [arch/blackfin/kernel/cplb-mpu/cplbmgr.o] Error 1

--

 

Follow-ups

 

--- Mike Frysinger                                           2009-11-11 09:14:50

there's a patch for this that i need to commit

 

--- Sonic Zhang                                              2009-11-24 23:26:20

This bug disappears in kernel rev. 7860.

 

--- Vivi Li                                                  2009-11-24 23:37:14

OK now.

Close it.

 

 

 

    Files

    Changes

    Commits

    Dependencies

    Duplicates

    Associations

    Tags

 

File Name     File Type     File Size     Posted By

No Files Were Found

Attachments

    Outcomes