[#5663] Build latest kernel fail at physmap

Document created by Aaronwu Employee on Sep 5, 2013
Version 1Show Document
  • View in full screen mode

[#5663] Build latest kernel fail at physmap

Submitted By: Vivi Li

Open Date

2009-11-05 22:16:26     Close Date

2009-11-06 05:28:51

Priority:

Medium     Assignee:

Bernd Schmidt

Status:

Closed     Fixed In Release:

N/A

Found In Release:

2010R1     Release:

Category:

Make Errors     Board:

N/A

Processor:

ALL     Silicon Revision:

Is this bug repeatable?:

Yes     Resolution:

Fixed

Uboot version or rev.:

    Toolchain version or rev.:

gcc4.3.4_svn3679

App binary format:

N/A     

Summary: Build latest kernel fail at physmap

Details:

 

Build latest kernel with default config fail at physmap.

 

--

  KSYM    .tmp_kallsyms2.S

  AS      .tmp_kallsyms2.o

  LD      vmlinux

  SYSMAP  System.map

  SYSMAP  .tmp_System.map

  OBJCOPY arch/blackfin/boot/vmlinux.bin

  GZIP    arch/blackfin/boot/vmlinux.bin.gz

  UIMAGE  arch/blackfin/boot/vmImage.gz

Image Name:   bf537-2.6.31.5-ADI-2010R1-pre-sv

Created:      Fri Nov  6 11:22:47 2009

Image Type:   Blackfin Linux Kernel Image (gzip compressed)

Data Size:    901709 Bytes = 880.58 kB = 0.86 MB

Load Address: 00001000

Entry Point:  0018d784

  Building modules, stage 2.

  MODPOST 59 modules

ERROR: "mtd_bdi_ro_mappable" [drivers/mtd/maps/physmap.ko] undefined!

make[2]: *** [__modpost] Error 1

make[1]: *** [modules] Error 2

make[1]: Leaving directory `/home/test/work/cruise/checkouts/uclinux-dist/linux-2.6.x'

make: *** [linux] Error 1

--

 

Follow-ups

 

--- Vivi Li                                                  2009-11-06 05:28:51

OK now.

Close it.

 

 

 

    Files

    Changes

    Commits

    Dependencies

    Duplicates

    Associations

    Tags

 

File Name     File Type     File Size     Posted By

No Files Were Found

Attachments

    Outcomes