[#5567] build nand for bf537 fails on trunk

Document created by Aaronwu Employee on Sep 4, 2013
Version 1Show Document
  • View in full screen mode

[#5567] build nand for bf537 fails on trunk

Submitted By: Mingquan Pan

Open Date

2009-09-27 23:25:59     Close Date

2009-10-15 22:47:08

Priority:

Medium     Assignee:

Barry Song

Status:

Closed     Fixed In Release:

N/A

Found In Release:

2010R1     Release:

Category:

N/A     Board:

N/A

Processor:

BF537     Silicon Revision:

Is this bug repeatable?:

Yes     Resolution:

Fixed

Uboot version or rev.:

    Toolchain version or rev.:

09r1-rc9

App binary format:

N/A     

Summary: build nand for bf537 fails on trunk

Details:

 

build nand for bf537 fails on trunk, with CONFIG_MTD_NAND_PLATFORM=y

 

test@uclinux55-bf537-cf-spi:..checkouts/uclinux-dist> make

chmod +x tools/romfs-inst.sh tools/modules-alias.sh tools/build-udev-perms.sh

. linux-2.6.x/.config; if [ "$CONFIG_INITRAMFS_SOURCE" != "" ]; then \

        mkdir -p `dirname $CONFIG_INITRAMFS_SOURCE`; \

        touch $CONFIG_INITRAMFS_SOURCE || exit 1; \

fi

rm -f linux-2.6.x/usr/initramfs_data.cpio

make ARCH=blackfin   CROSS_COMPILE=bfin-uclinux- -j1 -C linux-2.6.x  || exit 1

make[1]: Entering directory `/home/test/work/cruise/checkouts/uclinux-dist/linux-2.6.x'

  CHK     include/linux/version.h

  CHK     include/linux/utsrelease.h

  SYMLINK include/asm -> include/asm-blackfin

  CALL    scripts/checksyscalls.sh

  CHK     include/linux/compile.h

  GEN     usr/initramfs_data.cpio

  AS      usr/initramfs_data.o

  LD      usr/built-in.o

  CC      arch/blackfin/mach-bf537/boards/stamp.o

arch/blackfin/mach-bf537/boards/stamp.c: In function 鈥榖fin_plat_nand_cmd_ctrl鈥�

arch/blackfin/mach-bf537/boards/stamp.c:375: error: implicit declaration of function 鈥榳riteb鈥

make[2]: *** [arch/blackfin/mach-bf537/boards/stamp.o] Error 1

make[1]: *** [arch/blackfin/mach-bf537/boards] Error 2

make[1]: Leaving directory `/home/test/work/cruise/checkouts/uclinux-dist/linux-2.6.x'

make: *** [linux] Error 1

 

Follow-ups

 

--- Barry Song                                               2009-09-28 23:02:40

Fixed. Lost io.h headfile including writeb() symbols.

 

--- Mingquan Pan                                             2009-10-15 22:47:08

Yes.close.

 

 

 

    Files

    Changes

    Commits

    Dependencies

    Duplicates

    Associations

    Tags

 

File Name     File Type     File Size     Posted By

No Files Were Found

 

 

 

 

Save changes Back

Attachments

    Outcomes