[#5560] build kernel for bf518f ezbrd fails at net/bfin_mac.c now

Document created by Aaronwu Employee on Sep 4, 2013
Version 1Show Document
  • View in full screen mode

[#5560] build kernel for bf518f ezbrd fails at net/bfin_mac.c now

Submitted By: Mingquan Pan

Open Date

2009-09-26 23:54:13     Close Date

2009-09-27 05:53:07

Priority:

Medium     Assignee:

Mike Frysinger

Status:

Closed     Fixed In Release:

N/A

Found In Release:

2010R1     Release:

Category:

N/A     Board:

N/A

Processor:

BF537     Silicon Revision:

Is this bug repeatable?:

Yes     Resolution:

Fixed

Uboot version or rev.:

    Toolchain version or rev.:

09r1-rc9

App binary format:

N/A     

Summary: build kernel for bf518f ezbrd fails at net/bfin_mac.c now

Details:

 

build kernel for bf518f ezbrd fails at net/bfin_mac.c now from Sep 23.

 

  CC      fs/proc/interrupts.o^M

  CC      lib/is_single_threaded.o^M

  CC      drivers/net/bfin_mac.o^M

  CC      fs/proc/loadavg.o^M

  CC      lib/klist.o^M

  CC      fs/proc/meminfo.o^M

drivers/net/bfin_mac.c: In function 鈥榖fin_tx_hwtstamp鈥�^M

drivers/net/bfin_mac.c:722: error: implicit declaration of function 鈥榩r_dump_ptp_skb鈥^M

drivers/net/bfin_mac.c: At top level:^M

drivers/net/bfin_mac.c:808: warning: conflicting types for 鈥榩r_dump_ptp_skb鈥^M

drivers/net/bfin_mac.c:808: error: static declaration of 鈥榩r_dump_ptp_skb鈥�follows non-static declaration^M

drivers/net/bfin_mac.c:722: error: previous implicit declaration of 鈥榩r_dump_ptp_skb鈥�was here^M

make[3]: *** [drivers/net/bfin_mac.o] Error 1^M

make[2]: *** [drivers/net] Error 2^M

make[1]: *** [drivers] Error 2^M

make[1]: *** Waiting for unfinished jobs....^M

  LD      fs/quota/built-in.o^M

  CC      lib/kobject.o^M

 

Follow-ups

 

--- Mike Frysinger                                           2009-09-27 00:06:06

barry's latest commit fixed this for me

 

--- Mingquan Pan                                             2009-09-27 05:53:07

Yes,fixed.Close.

 

 

 

    Files

    Changes

    Commits

    Dependencies

    Duplicates

    Associations

    Tags

 

File Name     File Type     File Size     Posted By

No Files Were Found

Attachments

    Outcomes