[#5373] rsyslog fails to build (needs fork)

Document created by Aaronwu Employee on Sep 4, 2013
Version 1Show Document
  • View in full screen mode

[#5373] rsyslog fails to build (needs fork)

Submitted By: Ben Matthews

Open Date

2009-07-17 15:46:34     Close Date

2009-07-17 16:09:47

Priority:

Low     Assignee:

Nobody

Status:

Closed     Fixed In Release:

N/A

Found In Release:

snaps     Release:

Category:

uClinux-dist applications     Board:

N/A

Processor:

ALL     Silicon Revision:

Is this bug repeatable?:

Yes     Resolution:

Duplicate

Uboot version or rev.:

    Toolchain version or rev.:

Trunk as of Jun22 2009

App binary format:

N/A     

Summary: rsyslog fails to build (needs fork)

Details:

 

bfin-uclinux-gcc -DHAVE_CONFIG_H -I. -I..  -D_PATH_MODDIR=\"/lib/rsyslog/\" -pthread-DEMBED -D__uClinux__ -I/scratch/bmat/blackfin/uclinux-dist  -mcpu=bf532-0.5  -pipe -Wall -g -O2      -mcpu=bf532-0.5 -W -Wall -Wformat-security -Wshadow -Wcast-align -Wpointer-arith -Wmissing-format-attribute -g -c -o rsyslogd-omusrmsg.o `test -f 'omusrmsg.c' || echo '../'`omusrmsg.c

../conf.c:35:19: error: dlfcn.h: No such file or directory

bfin-uclinux-gcc -DHAVE_CONFIG_H -I. -I..  -D_PATH_MODDIR=\"/lib/rsyslog/\" -pthread-DEMBED -D__uClinux__ -I/scratch/bmat/blackfin/uclinux-dist  -mcpu=bf532-0.5  -pipe -Wall -g -O2      -mcpu=bf532-0.5 -W -Wall -Wformat-security -Wshadow -Wcast-align -Wpointer-arith -Wmissing-format-attribute -g -c -o rsyslogd-omfwd.o `test -f 'omfwd.c'|| echo '../'`omfwd.c

make[6]: *** [rsyslogd-conf.o] Error 1

make[6]: *** Waiting for unfinished jobs....

../omusrmsg.c: In function ‘wallmsg’:

../omusrmsg.c:185: warning: implicit declaration of function ‘fork’

make[6]: Leaving directory `/scratch/bmat/blackfin/uclinux-dist/user/rsyslog/build'

make[5]: *** [all-recursive] Error 1

make[5]: Leaving directory `/scratch/bmat/blackfin/uclinux-dist/user/rsyslog/build'

make[4]: *** [all] Error 2

make[4]: Leaving directory `/scratch/bmat/blackfin/uclinux-dist/user/rsyslog/build'

make[3]: *** [all] Error 2

make[3]: Leaving directory `/scratch/bmat/blackfin/uclinux-dist/user/rsyslog'

make[2]: *** [rsyslog] Error 2

make[2]: Leaving directory `/scratch/bmat/blackfin/uclinux-dist/user'

make[1]: *** [all] Error 2

make[1]: Leaving directory `/scratch/bmat/blackfin/uclinux-dist/user'

make: *** [subdirs] Error 1

 

Follow-ups

 

--- Robin Getz                                               2009-07-17 16:09:47

We have been keeping track of all the broken apps in 5214.

 

Closing.

 

 

 

    Files

    Changes

    Commits

    Dependencies

    Duplicates

    Associations

    Tags

 

File Name     File Type     File Size     Posted By

No Files Were Found

Attachments

    Outcomes