[#5350] Build bf526 kernel failed at traps.c

Document created by Aaronwu Employee on Sep 4, 2013
Version 1Show Document
  • View in full screen mode

[#5350] Build bf526 kernel failed at traps.c

Submitted By: Vivi Li

Open Date

2009-07-13 23:33:13     Close Date

2009-07-13 23:36:09

Priority:

Medium High     Assignee:

Nobody

Status:

Closed     Fixed In Release:

N/A

Found In Release:

N/A     Release:

Category:

Make Errors     Board:

EZBRD

Processor:

BF526     Silicon Revision:

Is this bug repeatable?:

Yes     Resolution:

Out of Date

Uboot version or rev.:

    Toolchain version or rev.:

gcc4.1_2009r1-rc9

App binary format:

N/A     

Summary: Build bf526 kernel failed at traps.c

Details:

 

Build bf526 kernel failed at traps.c.

 

--

arch/blackfin/kernel/traps.c: In function ‘trap_c’:^M

arch/blackfin/kernel/traps.c:606: error: ‘ANOMALY_05000281’ undeclared (first use in this function)^M

arch/blackfin/kernel/traps.c:606: error: (Each undeclared identifier is reported only once^M

arch/blackfin/kernel/traps.c:606: error: for each function it appears in.)^M

make[2]: *** [arch/blackfin/kernel/traps.o] Error 1^M

--

 

Follow-ups

 

--- Vivi Li                                                  2009-07-13 23:36:09

Out of date.

Close it.

 

 

 

    Files

    Changes

    Commits

    Dependencies

    Duplicates

    Associations

    Tags

 

File Name     File Type     File Size     Posted By

No Files Were Found

Attachments

    Outcomes