[#5342] branch head kernel build fails at traps.c on bf526 ezbrd

Document created by Aaronwu Employee on Sep 4, 2013
Version 1Show Document
  • View in full screen mode

[#5342] branch head kernel build fails at traps.c on bf526 ezbrd

Submitted By: Mingquan Pan

Open Date

2009-07-12 23:52:07     Close Date

2009-07-13 22:47:42

Priority:

Medium High     Assignee:

Robin Getz

Status:

Closed     Fixed In Release:

N/A

Found In Release:

N/A     Release:

Category:

N/A     Board:

N/A

Processor:

BF526     Silicon Revision:

Is this bug repeatable?:

Yes     Resolution:

Assigned (Not Start)

Uboot version or rev.:

    Toolchain version or rev.:

09r1-rc9

App binary format:

N/A     

Summary: branch head kernel build fails at traps.c on bf526 ezbrd

Details:

 

branch head kernel build fails at traps.c on bf526 and bf518 etc ezbrd from Jul 11.

 

test@uclinux81-bf526:~/work/cruise/checkouts/uclinux-dist> make

chmod +x tools/romfs-inst.sh tools/modules-alias.sh

. linux-2.6.x/.config; if [ "$CONFIG_INITRAMFS_SOURCE" != "" ]; then \

                mkdir -p `dirname $CONFIG_INITRAMFS_SOURCE`; \

                touch $CONFIG_INITRAMFS_SOURCE || exit 1; \

        fi

rm -f linux-2.6.x/usr/initramfs_data.cpio.gz

make ARCH=blackfin   CROSS_COMPILE=bfin-uclinux- -j4 -C linux-2.6.x  || exit 1

make[1]: Entering directory `/home/test/work/cruise/checkouts/uclinux-dist/linux-2.6.x'

  CHK     include/linux/version.h

  CHK     include/linux/utsrelease.h

  SYMLINK include/asm -> include/asm-blackfin

  CALL    scripts/checksyscalls.sh

  CHK     include/linux/compile.h

  GEN     usr/initramfs_data.cpio.gz

  AS      usr/initramfs_data.o

  LD      usr/built-in.o

  CC      arch/blackfin/kernel/traps.o

  CC      arch/blackfin/kernel/dma-mapping.o

arch/blackfin/kernel/traps.c: In function 鈥榯rap_c鈥�

arch/blackfin/kernel/traps.c:606: error: 鈥楢NOMALY_05000281鈥�undeclared (first use in this function)

arch/blackfin/kernel/traps.c:606: error: (Each undeclared identifier is reported only once

arch/blackfin/kernel/traps.c:606: error: for each function it appears in.)

make[2]: *** [arch/blackfin/kernel/traps.o] Error 1

make[2]: *** Waiting for unfinished jobs....

make[1]: *** [arch/blackfin/kernel] Error 2

make[1]: *** Waiting for unfinished jobs....

make[1]: INTERNAL: Exiting with 5 jobserver tokens available; should be 4!

make[1]: Leaving directory `/home/test/work/cruise/checkouts/uclinux-dist/linux-2.6.x'

make: *** [linux] Error 1

test@uclinux81-bf526:~/work/cruise/checkouts/uclinux-dist>

 

Follow-ups

 

--- Robin Getz                                               2009-07-13 08:16:34

Should be fixed.

 

-Robin

 

--- Mingquan Pan                                             2009-07-13 22:47:42

Yes,close.

 

 

 

    Files

    Changes

    Commits

    Dependencies

    Duplicates

    Associations

    Tags

 

File Name     File Type     File Size     Posted By

No Files Were Found

Attachments

    Outcomes