[#5170] build xenomai failed on 518f-ezbrd and bf538-ezkit at init.h

Document created by Aaronwu Employee on Sep 3, 2013
Version 1Show Document
  • View in full screen mode

[#5170] build xenomai failed on 518f-ezbrd and bf538-ezkit at init.h

Submitted By: Vivi Li

Open Date

2009-05-27 05:40:31     Close Date

2009-06-21 22:03:13

Priority:

Medium     Assignee:

Graf Yang

Status:

Closed     Fixed In Release:

N/A

Found In Release:

N/A     Release:

Category:

Make Errors     Board:

N/A

Processor:

BF518     Silicon Revision:

Is this bug repeatable?:

Yes     Resolution:

Fixed

Uboot version or rev.:

    Toolchain version or rev.:

gcc4.1-09r1_rc6

App binary format:

N/A     

Summary: build xenomai failed on 518f-ezbrd and bf538-ezkit at init.h

Details:

 

build xenomai failed on 518f-ezbrd at ints-priority.c

This bug exist on both trunk and 09r1.

 

--

  CC      arch/blackfin/kernel/sys_bfin.o^M

arch/blackfin/mach-common/ints-priority.c: In function ‘__ipipe_grab_irq’:^M

arch/blackfin/mach-common/ints-priority.c:1262: error: expected expression before ‘<<’ token^M

arch/blackfin/mach-common/ints-priority.c:1262: error: expected expression before ‘<<’ token^M

make[5]: *** [arch/blackfin/mach-common/ints-priority.o] Error 1^M

make[4]: *** [arch/blackfin/mach-common] Error 2^M

make[4]: *** Waiting for unfinished jobs....^M

--

 

Follow-ups

 

--- Graf Yang                                                2009-06-01 06:53:18

Fixed on trunk and branch 09R1

 

--- Vivi Li                                                  2009-06-08 02:33:53

xenomai still fails on 518f-ezbrd, but it fails at init.h, instead of

ints-priority.c.

 

--

  CC      drivers/char/tty_ldisc.o^M

In file included from

/home/test/work/cruise/checkouts/uclinux-dist/linux-2.6.x/arch/blackfin/include/asm/xenomai/bits/init.h:28,^M

                 from kernel/xenomai/nucleus/module.c:37:^M

/home/test/work/cruise/checkouts/uclinux-dist/linux-2.6.x/arch/blackfin/include/asm/xenomai/calibration.h:44:2:

error: #error "unsupported Blackfin processor"^M

In file included from

/home/test/work/cruise/checkouts/uclinux-dist/linux-2.6.x/arch/blackfin/include/asm/xenomai/bits/init.h:28,^M

                 from kernel/xenomai/nucleus/module.c:37:^M

/home/test/work/cruise/checkouts/uclinux-dist/linux-2.6.x/arch/blackfin/include/asm/xenomai/calibration.h:

In function ‘xnarch_get_sched_latency’:^M

/home/test/work/cruise/checkouts/uclinux-dist/linux-2.6.x/arch/blackfin/include/asm/xenomai/calibration.h:48:

error: ‘__sched_latency’ undeclared (first use in this function)^M

/home/test/work/cruise/checkouts/uclinux-dist/linux-2.6.x/arch/blackfin/include/asm/xenomai/calibration.h:48:

error: (Each undeclared identifier is reported only once^M

/home/test/work/cruise/checkouts/uclinux-dist/linux-2.6.x/arch/blackfin/include/asm/xenomai/calibration.h:48:

error: for each function it appears in.)^M

make[7]: *** [kernel/xenomai/nucleus/module.o] Error 1

--

 

--- Vivi Li                                                  2009-06-10 03:40:13

bf538-ezkit has the same problem.

 

--- Graf Yang                                                2009-06-19 04:30:35

Fixed on trunk and branch 09R1.

 

--- Vivi Li                                                  2009-06-21 22:03:13

OK now. close it.

 

 

 

    Files

    Changes

    Commits

    Dependencies

    Duplicates

    Associations

    Tags

 

File Name     File Type     File Size     Posted By

config.xenomai    application/octet-stream    31771    Vivi Li

Attachments

Outcomes