[#5132] Build default bf538-ezkit kernel fails in trunk

Document created by Aaronwu Employee on Sep 3, 2013
Version 1Show Document
  • View in full screen mode

[#5132] Build default bf538-ezkit kernel fails in trunk

Submitted By: Vivi Li

Open Date

2009-05-15 05:50:52     Close Date

2009-05-21 22:20:35

Priority:

Medium High     Assignee:

Sonic Zhang

Status:

Closed     Fixed In Release:

N/A

Found In Release:

N/A     Release:

Category:

Make Errors     Board:

N/A

Processor:

BF538     Silicon Revision:

Is this bug repeatable?:

Yes     Resolution:

Fixed

Uboot version or rev.:

    Toolchain version or rev.:

gcc4.1-09r1_rc6

App binary format:

N/A     

Summary: Build default bf538-ezkit kernel fails in trunk

Details:

 

Build default bf538-ezkit kernel fails in trunk.

 

--

  CC      arch/blackfin/kernel/cplb-nompu/cplbmgr.o^M

  CC      arch/blackfin/kernel/bfin_dma_5xx.o^M

arch/blackfin/kernel/cplb-nompu/cplbmgr.c:58:5: warning: "ANOMALY_05000125" is not defined^M

  LD      arch/blackfin/kernel/cplb-nompu/built-in.o^M

  CC      kernel/fork.o^M

arch/blackfin/kernel/bfin_dma_5xx.c: In function ‘blackfin_dma_early_init’:^M

arch/blackfin/kernel/bfin_dma_5xx.c:240: error: implicit declaration of function ‘bfin_write_MDMA_S1_CONFIG’^M

arch/blackfin/kernel/bfin_dma_5xx.c: In function ‘early_dma_memcpy’:^M

arch/blackfin/kernel/bfin_dma_5xx.c:265: error: ‘MDMA_S1_NEXT_DESC_PTR’ undeclared (first use in this function)^M

arch/blackfin/kernel/bfin_dma_5xx.c:265: error: (Each undeclared identifier is reported only once^M

arch/blackfin/kernel/bfin_dma_5xx.c:265: error: for each function it appears in.)^M

arch/blackfin/kernel/bfin_dma_5xx.c:266: error: ‘MDMA_D0_NEXT_DESC_PTR’ undeclared (first use in this function)^M

arch/blackfin/kernel/bfin_dma_5xx.c:267: error: ‘MDMA_S0_NEXT_DESC_PTR’ undeclared (first use in this function)^M

arch/blackfin/kernel/bfin_dma_5xx.c:269: error: ‘MDMA_D1_NEXT_DESC_PTR’ undeclared (first use in this function)^M

arch/blackfin/kernel/bfin_dma_5xx.c: In function ‘early_dma_memcpy_done’:^M

arch/blackfin/kernel/bfin_dma_5xx.c:305: error: implicit declaration of function ‘bfin_read_MDMA_S1_CONFIG’^M

arch/blackfin/kernel/bfin_dma_5xx.c:305: error: implicit declaration of function ‘bfin_read_MDMA_D1_IRQ_STATUS’^M

arch/blackfin/kernel/bfin_dma_5xx.c:309: error: implicit declaration of function ‘bfin_write_MDMA_D1_IRQ_STATUS’^M

arch/blackfin/kernel/bfin_dma_5xx.c:318: error: implicit declaration of function ‘bfin_write_MDMA_D1_CONFIG’^M

make[2]: *** [arch/blackfin/kernel/bfin_dma_5xx.o] Error 1^M

make[2]: *** Waiting for unfinished jobs....^M

make[1]: *** [arch/blackfin/kernel] Error 2^M

make[1]: *** Waiting for unfinished jobs....^M

--

 

Follow-ups

 

--- Sonic Zhang                                              2009-05-21 02:01:00

Fixed

 

--- Vivi Li                                                  2009-05-21 22:20:35

OK now. Close it.

 

 

 

    Files

    Changes

    Commits

    Dependencies

    Duplicates

    Associations

    Tags

 

File Name     File Type     File Size     Posted By

No Files Were Found

Attachments

    Outcomes