[#5114] build kernel fails at setup.c for bf537-stamp

Document created by Aaronwu Employee on Sep 3, 2013
Version 1Show Document
  • View in full screen mode

[#5114] build kernel fails at setup.c for bf537-stamp

Submitted By: Vivi Li

Open Date

2009-05-08 00:45:05     Close Date

2009-05-08 03:43:14

Priority:

Medium     Assignee:

Sonic Zhang

Status:

Closed     Fixed In Release:

N/A

Found In Release:

N/A     Release:

Category:

N/A     Board:

N/A

Processor:

ALL     Silicon Revision:

Is this bug repeatable?:

Yes     Resolution:

Fixed

Uboot version or rev.:

    Toolchain version or rev.:

toolchain4.1-09r1_rc6

App binary format:

N/A     

Summary: build kernel fails at setup.c for bf537-stamp

Details:

 

build kernel for bf537-stamp, it fails at arch/blackfin/kernel/setup.c

 

--

  CC      arch/blackfin/kernel/setup.o^M

arch/blackfin/kernel/setup.c: In function ‘setup_arch’:^M

arch/blackfin/kernel/setup.c:804: error: ‘ANOMALY_05000274’ undeclared (first use in this function)^M

arch/blackfin/kernel/setup.c:804: error: (Each undeclared identifier is reported only once^M

arch/blackfin/kernel/setup.c:804: error: for each function it appears in.)^M

make[2]: *** [arch/blackfin/kernel/setup.o] Error 1^M

--

 

Follow-ups

 

--- Sonic Zhang                                              2009-05-08 00:55:03

Add ANOMALY_05000274 in head file.

 

--- Vivi Li                                                  2009-05-08 03:43:14

OK now. Close it.

 

 

 

    Files

    Changes

    Commits

    Dependencies

    Duplicates

    Associations

    Tags

 

File Name     File Type     File Size     Posted By

No Files Were Found

Attachments

    Outcomes