[#5113] build kernel fails at drivers/serial/bfin_5xx.c for bf561-ezkit

Document created by Aaronwu Employee on Sep 3, 2013
Version 1Show Document
  • View in full screen mode

[#5113] build kernel fails at drivers/serial/bfin_5xx.c for bf561-ezkit

Submitted By: Vivi Li

Open Date

2009-05-08 00:34:35     Close Date

2009-05-08 05:22:19

Priority:

Medium     Assignee:

Sonic Zhang

Status:

Closed     Fixed In Release:

N/A

Found In Release:

N/A     Release:

Category:

N/A     Board:

N/A

Processor:

BF561     Silicon Revision:

Is this bug repeatable?:

Yes     Resolution:

Fixed

Uboot version or rev.:

    Toolchain version or rev.:

toolchain4.1-09r1_rc6

App binary format:

N/A     

Summary: build kernel fails at drivers/serial/bfin_5xx.c for bf561-ezkit

Details:

 

build kernel for bf561-ezkit, it fails at drivers/serial/bfin_5xx.c.

 

--

  CC      drivers/serial/bfin_5xx.o^M

drivers/serial/bfin_5xx.c: In function ‘bfin_serial_set_termios’:^M

drivers/serial/bfin_5xx.c:836: error: missing terminating " character^M

drivers/serial/bfin_5xx.c:837: error: expected ‘)’ before ‘case’^M

drivers/serial/bfin_5xx.c:837: error: stray ‘\’ in program^M

drivers/serial/bfin_5xx.c:837: error: missing terminating " character^M

drivers/serial/bfin_5xx.c:902: error: expected ‘;’ before ‘}’ token^M

drivers/serial/bfin_5xx.c:812: warning: unused variable ‘ier’^M

drivers/serial/bfin_5xx.c:812: warning: unused variable ‘val’^M

drivers/serial/bfin_5xx.c:811: warning: unused variable ‘quot’^M

drivers/serial/bfin_5xx.c:811: warning: unused variable ‘baud’^M

drivers/serial/bfin_5xx.c:810: warning: unused variable ‘flags’^M

drivers/serial/bfin_5xx.c:809: warning: unused variable ‘uart’^M

make[3]: *** [drivers/serial/bfin_5xx.o] Error 1^M

--

 

Follow-ups

 

--- Sonic Zhang                                              2009-05-08 01:07:11

fixed

 

--- Vivi Li                                                  2009-05-08 05:22:19

OK. Close it.

 

 

 

    Files

    Changes

    Commits

    Dependencies

    Duplicates

    Associations

    Tags

 

File Name     File Type     File Size     Posted By

No Files Were Found

Attachments

    Outcomes