[#4847] build e2fsprogs failed after update to version 1.41.4

Document created by Aaronwu Employee on Aug 30, 2013
Version 1Show Document
  • View in full screen mode

[#4847] build e2fsprogs failed after update to version 1.41.4

Submitted By: Vivi Li

Open Date

2009-02-02 05:21:02     Close Date

2009-04-28 00:16:49

Priority:

Medium     Assignee:

Mike Frysinger

Status:

Closed     Fixed In Release:

N/A

Found In Release:

N/A     Release:

Category:

Make Errors     Board:

N/A

Processor:

ALL     Silicon Revision:

Is this bug repeatable?:

Yes     Resolution:

Fixed

Uboot version or rev.:

    Toolchain version or rev.:

gcc4.1_2009-01-19

App binary format:

N/A     

Summary: build e2fsprogs failed after update to version 1.41.4

Details:

 

Build e2fsprogs failed after update e2fsprogs to version 1.41.4.

Enable some apps such as mke2fs and e2fsck, e2fsprogs will be built.

 

Bellow is the log:

--

make[5]: Entering directory `/home/test/work/cruise/checkouts/uclinux-dist/user/e2fsprogs/build-e2fsprogs-1.41.4'^M

cd .; CONFIG_FILES=./lib/uuid/uuid_types.h ./config.status^M

../../../e2fsprogs-1.41.4/lib/ss/get_readline.c:24: warning: ‘ss_release_readline’ defined but not used^M

        GEN_LIB libss.a^M

make[5]: Leaving directory `/home/test/work/cruise/checkouts/uclinux-dist/user/e2fsprogs/build-e2fsprogs-1.41.4/lib/ss'^M

making all in lib/e2p^M

make[5]: Entering directory `/home/test/work/cruise/checkouts/uclinux-dist/user/e2fsprogs/build-e2fsprogs-1.41.4/lib/e2p'^M

make[5]: *** No rule to make target `../../lib/ext2fs/ext2_err.h', needed by `feature.o'.  Stop.^M

make[5]: *** Waiting for unfinished jobs....^M

make[5]: Leaving directory `/home/test/work/cruise/checkouts/uclinux-dist/user/e2fsprogs/build-e2fsprogs-1.41.4/lib/e2p'^M

make[4]: *** [all-libs-recursive] Error 1^M

make[4]: *** Waiting for unfinished jobs....^M

config.status: creating ./lib/uuid/uuid_types.h^M

config.status: executing default-1 commands^M

make[5]: Leaving directory `/home/test/work/cruise/checkouts/uclinux-dist/user/e2fsprogs/build-e2fsprogs-1.41.4'^M

make[5]: Entering directory `/home/test/work/cruise/checkouts/uclinux-dist/user/e2fsprogs/build-e2fsprogs-1.41.4/lib/et'^M

make[5]: `compile_et' is up to date.^M

make[5]: Leaving directory `/home/test/work/cruise/checkouts/uclinux-dist/user/e2fsprogs/build-e2fsprogs-1.41.4/lib/et'^M

make[5]: Entering directory `/home/test/work/cruise/checkouts/uclinux-dist/user/e2fsprogs/build-e2fsprogs-1.41.4/lib/ext2fs'^M

        SUBST ext2_err.et^M

        COMPILE_ET ext2_err.et^M

make[5]: Leaving directory `/home/test/work/cruise/checkouts/uclinux-dist/user/e2fsprogs/build-e2fsprogs-1.41.4/lib/ext2fs'^M

make[4]: Leaving directory `/home/test/work/cruise/checkouts/uclinux-dist/user/e2fsprogs/build-e2fsprogs-1.41.4'^M

make[3]: *** [all] Error 2^M

make[3]: Leaving directory `/home/test/work/cruise/checkouts/uclinux-dist/user/e2fsprogs'^M

make[2]: *** [e2fsprogs] Error 2^M

make[2]: Leaving directory `/home/test/work/cruise/checkouts/uclinux-dist/user'^M

make[1]: *** [all] Error 2^M

make[1]: Leaving directory `/home/test/work/cruise/checkouts/uclinux-dist/user'^M

make: *** [subdirs] Error 1^M

 

Follow-ups

 

--- Vivi Li                                                  2009-03-12 05:51:21

This bug doesn't happen every time. It seems that it has something to do with

the order of compiling.

Kernel can always be built with NON_SMP_BUILD=1.

 

--- Mike Frysinger                                           2009-04-23 23:15:03

should be all set now by updating e2fsprogs dependencies

 

--- Vivi Li                                                  2009-04-28 00:16:49

OK, close it.

 

 

 

    Files

    Changes

    Commits

    Dependencies

    Duplicates

    Associations

    Tags

 

File Name     File Type     File Size     Posted By

No Files Were Found

Attachments

    Outcomes