[#4812] built pack_cis fails to be used now

Document created by Aaronwu Employee on Aug 30, 2013
Version 1Show Document
  • View in full screen mode

[#4812] built pack_cis fails to be used now

Submitted By: Mingquan Pan

Open Date

2009-01-16 02:56:13     Close Date

2009-02-04 22:57:42

Priority:

Medium     Assignee:

Cliff Cai

Status:

Closed     Fixed In Release:

N/A

Found In Release:

N/A     Release:

Category:

N/A     Board:

STAMP

Processor:

BF537     Silicon Revision:

Is this bug repeatable?:

Yes     Resolution:

Not reproducible

Uboot version or rev.:

    Toolchain version or rev.:

Nov 11

App binary format:

N/A     

Summary: built pack_cis fails to be used now

Details:

 

built pack_cis fails to be used now when building kernel for cf_card case.

 

ake[2]: Entering directory `/home/test/work/cruise/checkouts/uclinux-dist/user/pcmcia-cs'^M

make -f Makefile.uClinux romfs^M

make[3]: Entering directory `/home/test/work/cruise/checkouts/uclinux-dist/user/pcmcia-cs'^M

make[4]: Entering directory `/home/test/work/cruise/checkouts/uclinux-dist/user/pcmcia-cs/cardmgr'^M

cp -f cardmgr cardctl ifport ifuser scsi_info pcinitrd /home/test/work/cruise/checkouts/uclinux-dist/romfs/sbin^M

chmod u+s /home/test/work/cruise/checkouts/uclinux-dist/romfs/sbin/cardctl^M

make[4]: Leaving directory `/home/test/work/cruise/checkouts/uclinux-dist/user/pcmcia-cs/cardmgr'^M

make[4]: Entering directory `/home/test/work/cruise/checkouts/uclinux-dist/user/pcmcia-cs/flash'^M

cp -f ftl_format ftl_check /home/test/work/cruise/checkouts/uclinux-dist/romfs/sbin^M

make[4]: Leaving directory `/home/test/work/cruise/checkouts/uclinux-dist/user/pcmcia-cs/flash'^M

make[4]: Entering directory `/home/test/work/cruise/checkouts/uclinux-dist/user/pcmcia-cs/debug-tools'^M

cp -f dump_cis pack_cis /home/test/work/cruise/checkouts/uclinux-dist/romfs/sbin^M

make[4]: Leaving directory `/home/test/work/cruise/checkouts/uclinux-dist/user/pcmcia-cs/debug-tools'^M

make[4]: Entering directory `/home/test/work/cruise/checkouts/uclinux-dist/user/pcmcia-cs/etc'^M

make[5]: Entering directory `/home/test/work/cruise/checkouts/uclinux-dist/user/pcmcia-cs/etc/cis'^M

../../debug-tools/pack_cis -o LA-PCM.dat LA-PCM.cis^M

../../debug-tools/pack_cis: ../../debug-tools/pack_cis: cannot execute binary file^M

make[5]: *** [LA-PCM.dat] Error 126^M

make[5]: Leaving directory `/home/test/work/cruise/checkouts/uclinux-dist/user/pcmcia-cs/etc/cis'^M

make[4]: *** [install] Error 2^M

make[4]: Leaving directory `/home/test/work/cruise/checkouts/uclinux-dist/user/pcmcia-cs/etc'^M

make[3]: *** [romfs] Error 2^M

make[3]: Leaving directory `/home/test/work/cruise/checkouts/uclinux-dist/user/pcmcia-cs'^M

make[2]: *** [romfs] Error 2^M

make[2]: Leaving directory `/home/test/work/cruise/checkouts/uclinux-dist/user/pcmcia-cs'^M

make[1]: *** [romfs] Error 2^M

make[1]: Leaving directory `/home/test/work/cruise/checkouts/uclinux-dist/user'^M

make: *** [romfs.subdirs] Error 1^M

 

the whole log is attached.

 

Follow-ups

 

--- Cliff Cai                                                2009-01-23 00:01:12

it works for me.See build log attached.

uclinux-dist Revision:7688

linux-kernel Revision:6036

 

Cliff

 

--- Mingquan Pan                                             2009-02-04 22:57:42

Yeah, it is ok now on trunk. Close.

 

 

 

    Files

    Changes

    Commits

    Dependencies

    Duplicates

    Associations

    Tags

 

File Name     File Type     File Size     Posted By

build_cfcard_kernel_log.tar.gz    application/x-gzip    71192    Mingquan Pan

build_cfcard_kernel_log.tar.gz    application/x-gzip    150260    Cliff Cai

Attachments

    Outcomes