[#4736] build readline stops for the destination folder Permission denied

Document created by Aaronwu Employee on Aug 30, 2013
Version 1Show Document
  • View in full screen mode

[#4736] build readline stops for the destination folder Permission denied

Submitted By: Mingquan Pan

Open Date

2008-12-22 03:32:46     Close Date

2008-12-22 04:25:52

Priority:

Medium     Assignee:

Mike Frysinger

Status:

Closed     Fixed In Release:

N/A

Found In Release:

N/A     Release:

Category:

N/A     Board:

N/A

Processor:

N/A     Silicon Revision:

Is this bug repeatable?:

Yes     Resolution:

Fixed

Uboot version or rev.:

    Toolchain version or rev.:

Nov 11

App binary format:

N/A     

Summary: build readline stops for the destination folder Permission denied

Details:

 

build readline stops for the destination folder Permission denied after it is been updated to 5.2_p13.

 

make[5]: Entering directory `/home/test/work/cruise/checkouts/uclinux-dist/lib/readline/build-readline-5.2_p13/shlib'^M

make[5]: Nothing to be done for `all'.^M

make[5]: Leaving directory `/home/test/work/cruise/checkouts/uclinux-dist/lib/readline/build-readline-5.2_p13/shlib'^M

( cd shlib ; make -w DESTDIR=/home/test/work/cruise/checkouts/uclinux-dist/staging install )^M

make[5]: Entering directory `/home/test/work/cruise/checkouts/uclinux-dist/lib/readline/build-readline-5.2_p13/shlib'^M

/bin/sh ../../readline-5.2_p13/support/mkdirs /home/test/work/cruise/checkouts/uclinux-dist/staging/usr/lib^M

/bin/sh ../../readline-5.2_p13/support/shlib-install -O linux-uclibc -d /home/test/work/cruise/checkouts/uclinux-dist/staging/usr/lib -b /home/test/work/cruise/checkouts/uclinux-dist/staging/usr/bin -i "/usr/bin/install -c -m 644" libhistory.so.5.2^M

/bin/sh ../../readline-5.2_p13/support/shlib-install -O linux-uclibc -d /home/test/work/cruise/checkouts/uclinux-dist/staging/usr/lib -b /home/test/work/cruise/checkouts/uclinux-dist/staging/usr/bin -i "/usr/bin/install -c -m 644" libreadline.so.5.2^M

install: you may need to run ldconfig^M

make[5]: Leaving directory `/home/test/work/cruise/checkouts/uclinux-dist/lib/readline/build-readline-5.2_p13/shlib'^M

make[4]: Leaving directory `/home/test/work/cruise/checkouts/uclinux-dist/lib/readline/build-readline-5.2_p13'^M

make post-build^M

make[4]: Entering directory `/home/test/work/cruise/checkouts/uclinux-dist/lib/readline'^M

make -C build-readline-5.2_p13 install-shared^M

make[5]: Entering directory `/home/test/work/cruise/checkouts/uclinux-dist/lib/readline/build-readline-5.2_p13'^M

/bin/sh ../readline-5.2_p13/support/mkinstalldirs /usr/include \^M

        /usr/include/readline /usr/lib \^M

        /usr/share/info /usr/share/man/man3^M

for f in readline.h chardefs.h keymaps.h history.h tilde.h rlstdc.h rlconf.h rltypedefs.h; do \^M

        /usr/bin/install -c -m 644 ../readline-5.2_p13/$f /usr/include/readline ; \^M

done^M

/usr/bin/install: cannot remove `/usr/include/readline/readline.h': Permission denied^M

/usr/bin/install: cannot remove `/usr/include/readline/chardefs.h': Permission denied^M

/usr/bin/install: cannot remove `/usr/include/readline/keymaps.h': Permission denied^M

/usr/bin/install: cannot remove `/usr/include/readline/history.h': Permission denied^M

/usr/bin/install: cannot remove `/usr/include/readline/tilde.h': Permission denied^M

/usr/bin/install: cannot remove `/usr/include/readline/rlstdc.h': Permission denied^M

/usr/bin/install: cannot remove `/usr/include/readline/rlconf.h': Permission denied^M

/usr/bin/install: cannot remove `/usr/include/readline/rltypedefs.h': Permission denied^M

make[5]: *** [install-headers] Error 1^M

make[5]: Leaving directory `/home/test/work/cruise/checkouts/uclinux-dist/lib/readline/build-readline-5.2_p13'^M

make[4]: *** [post-build] Error 2^M

make[4]: Leaving directory `/home/test/work/cruise/checkouts/uclinux-dist/lib/readline'^M

make[3]: *** [all] Error 2^M

make[3]: Leaving directory `/home/test/work/cruise/checkouts/uclinux-dist/lib/readline'^M

make[2]: *** [readline] Error 2^M

make[2]: Leaving directory `/home/test/work/cruise/checkouts/uclinux-dist/lib'^M

make[1]: *** [all] Error 2^M

 

Follow-ups

 

--- Mike Frysinger                                           2008-12-22 04:05:05

should be fixed now

 

--- Mingquan Pan                                             2008-12-22 04:25:52

Yes,close.

 

 

 

    Files

    Changes

    Commits

    Dependencies

    Duplicates

    Associations

    Tags

 

File Name     File Type     File Size     Posted By

config.linphone_ad1981b    application/octet-stream    32446    Mingquan Pan

Outcomes