[#4708] Blackfin irda build fails for bf533-stamp

Document created by Aaronwu Employee on Aug 30, 2013
Version 1Show Document
  • View in full screen mode

[#4708] Blackfin irda build fails for bf533-stamp

Submitted By: Mike Frysinger

Open Date

2008-12-09 12:09:36     Close Date

2008-12-11 22:16:32

Priority:

Medium     Assignee:

Graf Yang

Status:

Closed     Fixed In Release:

N/A

Found In Release:

N/A     Release:

Category:

N/A     Board:

N/A

Processor:

N/A     Silicon Revision:

Is this bug repeatable?:

Yes     Resolution:

Fixed

Uboot version or rev.:

    Toolchain version or rev.:

App binary format:

N/A     

Summary: Blackfin irda build fails for bf533-stamp

Details:

 

arch/blackfin/mach-bf533/boards/stamp.c:356: error: 'IRQ_UART0_RX' undeclared here (not in a function)

arch/blackfin/mach-bf533/boards/stamp.c:361: error: 'CH_UART0_RX' undeclared here (not in a function)

make[1]: *** [arch/blackfin/mach-bf533/boards/stamp.o] Error 1

 

Follow-ups

 

--- Graf Yang                                                2008-12-11 21:32:04

Now is fixed.

 

 

 

    Files

    Changes

    Commits

    Dependencies

    Duplicates

    Associations

    Tags

 

File Name     File Type     File Size     Posted By

No Files Were Found

Attachments

    Outcomes