[#4574] Build 537 kernel failed at ad1836 for latest trunk

Document created by Aaronwu Employee on Aug 29, 2013
Version 1Show Document
  • View in full screen mode

[#4574] Build 537 kernel failed at ad1836 for latest trunk

Submitted By: Vivi Li

Open Date

2008-10-30 02:48:21     Close Date

2008-11-03 05:21:10

Priority:

Medium     Assignee:

Bryan Wu

Status:

Closed     Fixed In Release:

N/A

Found In Release:

N/A     Release:

Category:

N/A     Board:

N/A

Processor:

N/A     Silicon Revision:

Is this bug repeatable?:

Yes     Resolution:

Fixed

Uboot version or rev.:

    Toolchain version or rev.:

toolchain-2008_Oct_10

App binary format:

N/A     

Summary: Build 537 kernel failed at ad1836 for latest trunk

Details:

 

Build 537 kernel failed at ad1836 in latest trunk.

 

--

  CC [M]  sound/blackfin/ad1836.o^M

sound/blackfin/ad1836.c: In function ‘snd_ad1836_playback_prepare’:^M

sound/blackfin/ad1836.c:1060: error: implicit declaration of function ‘snd_assert’^M

sound/blackfin/ad1836.c:1060: error: expected expression before ‘return’^M

sound/blackfin/ad1836.c: In function ‘snd_ad1836_capture_prepare’:^M

sound/blackfin/ad1836.c:1115: error: expected expression before ‘return’^M

sound/blackfin/ad1836.c: In function ‘snd_ad1836_playback_trigger’:^M

sound/blackfin/ad1836.c:1142: error: expected expression before ‘return’^M

sound/blackfin/ad1836.c: In function ‘snd_ad1836_capture_trigger’:^M

sound/blackfin/ad1836.c:1193: error: expected expression before ‘return’^M

sound/blackfin/ad1836.c: In function ‘snd_ad1836_playback_copy’:^M

sound/blackfin/ad1836.c:1301: error: expected expression before ‘return’^M

make[3]: *** [sound/blackfin/ad1836.o] Error 1^M

make[2]: *** [sound/blackfin] Error 2^M

make[1]: *** [sound] Error 2^M

make[1]: Leaving directory `/home/test/work/cruise/checkouts/uclinux-dist/linux-2.6.x'^M

make: *** [linux] Error 1^M

--

 

Follow-ups

 

--- Bryan Wu                                                 2008-10-30 04:29:28

Fixed in trunk.

 

-Bryan

 

--- Vivi Li                                                  2008-11-03 05:21:10

OK now. Closed. Thanks!

 

 

 

    Files

    Changes

    Commits

    Dependencies

    Duplicates

    Associations

    Tags

 

File Name     File Type     File Size     Posted By

No Files Were Found

Attachments

    Outcomes