[#4441] kgdb over ethernet build fails on trunk

Document created by Aaronwu Employee on Aug 29, 2013
Version 1Show Document
  • View in full screen mode

[#4441] kgdb over ethernet build fails on trunk

Submitted By: Mingquan Pan

Open Date

2008-09-24 04:22:16     Close Date

2008-09-26 05:54:28

Priority:

Medium     Assignee:

Sonic Zhang

Status:

Closed     Fixed In Release:

N/A

Found In Release:

N/A     Release:

Category:

N/A     Board:

N/A

Processor:

N/A     Silicon Revision:

Is this bug repeatable?:

Yes     Resolution:

Fixed

Uboot version or rev.:

    Toolchain version or rev.:

trunk Sep 21

App binary format:

N/A     

Summary: kgdb over ethernet build fails on trunk

Details:

 

kgdb over ethernet build fails on trunk.

 

  CC      drivers/net/mii.o

  CC [M]  drivers/net/irda/irtty-sir.o

  CC [M]  drivers/net/irda/sir_dev.o

  CC [M]  drivers/net/irda/sir_dongle.o

  LD [M]  drivers/net/irda/sir-dev.o

  CC [M]  drivers/net/irda/bfin_sir.o

  CC      drivers/net/phy/phy.o

  CC      drivers/net/phy/phy_device.o

  CC      drivers/net/phy/mdio_bus.o

  LD      drivers/net/phy/libphy.o

  CC      drivers/net/phy/smsc.o

  LD      drivers/net/phy/built-in.o

  CC      drivers/net/Space.o

  CC      drivers/net/loopback.o

  CC      drivers/net/bfin_mac.o

  CC      drivers/net/kgdboe.o

drivers/net/kgdboe.c: In function 鈥榬x_hook鈥�

drivers/net/kgdboe.c:75: error: implicit declaration of function 鈥榢gdb_schedule_breakpoint鈥

drivers/net/kgdboe.c: At top level:

drivers/net/kgdboe.c:97: warning: initialization from incompatible pointer type

make[3]: *** [drivers/net/kgdboe.o] Error 1

make[2]: *** [drivers/net] Error 2

make[1]: *** [drivers] Error 2

make[1]: Leaving directory `/home/test/work/cruise/checkouts/uclinux-dist/linux-2.6.x'

 

Follow-ups

 

--- Mingquan Pan                                             2008-09-26 05:54:28

Yes,close.

 

 

 

    Files

    Changes

    Commits

    Dependencies

    Duplicates

    Associations

    Tags

 

File Name     File Type     File Size     Posted By

No Files Were Found

Attachments

    Outcomes