[#4399] kernel build fails for bf548 board on trunk due to SIZE_1M undefined

Document created by Aaronwu Employee on Aug 29, 2013
Version 1Show Document
  • View in full screen mode

[#4399] kernel build fails for bf548 board on trunk due to SIZE_1M undefined

Submitted By: Mingquan Pan

Open Date

2008-08-29 05:15:12     Close Date

2008-08-31 22:53:35

Priority:

Medium     Assignee:

Mike Frysinger

Status:

Closed     Fixed In Release:

N/A

Found In Release:

N/A     Release:

Category:

N/A     Board:

N/A

Processor:

N/A     Silicon Revision:

Is this bug repeatable?:

Yes     Resolution:

Fixed

Uboot version or rev.:

    Toolchain version or rev.:

trunk Aug 20 toolchain

App binary format:

N/A     

Summary: kernel build fails for bf548 board on trunk due to SIZE_1M undefined

Details:

 

kernel build fails for bf548 board on trunk for declare issue now.

 

test@uclinux90-bf548-kernel:~/work/cruise/checkouts/uclinux-dist/linux-2.6.x> make

  CHK     include/linux/version.h

  CHK     include/linux/utsrelease.h

  CALL    scripts/checksyscalls.sh

  CHK     include/linux/compile.h

  CC      arch/blackfin/mach-bf548/boards/ezkit.o

arch/blackfin/mach-bf548/boards/ezkit.c:369: error: 鈥楽IZE_1M鈥�undeclared here (not in a function)

make[1]: *** [arch/blackfin/mach-bf548/boards/ezkit.o] Error 1

make: *** [arch/blackfin/mach-bf548/boards] Error 2

 

Follow-ups

 

--- Mike Frysinger                                           2008-08-29 12:39:10

due to cplb.h drop ... but this code shouldnt be using that define anyways ...

 

--- Mike Frysinger                                           2008-08-29 12:50:36

fixed in svn trunk

 

--- Mingquan Pan                                             2008-08-31 23:53:35

Yes,close.

 

 

 

    Files

    Changes

    Commits

    Dependencies

    Duplicates

    Associations

    Tags

 

File Name     File Type     File Size     Posted By

No Files Were Found

Attachments

    Outcomes