[#4368] build e2fsprogs-1.40.9 fails for undefined reference to `_sbrk'

Document created by Aaronwu Employee on Aug 29, 2013
Version 1Show Document
  • View in full screen mode

[#4368] build e2fsprogs-1.40.9 fails for undefined reference to `_sbrk'

Submitted By: Mingquan Pan

Open Date

2008-08-19 05:41:22     Close Date

2008-08-20 04:21:38

Priority:

Medium     Assignee:

Mike Frysinger

Status:

Closed     Fixed In Release:

N/A

Found In Release:

N/A     Release:

Category:

N/A     Board:

N/A

Processor:

BF537     Silicon Revision:

Is this bug repeatable?:

Yes     Resolution:

Rejected

Uboot version or rev.:

    Toolchain version or rev.:

08r1.5-14

App binary format:

N/A     

Summary: build e2fsprogs-1.40.9 fails for undefined reference to `_sbrk'

Details:

 

build e2fsprogs-1.40.9 fails for undefined reference to `_sbrk' on trunk now.

 

make[5]: Nothing to be done for `all'.

make[5]: Leaving directory `/home/test/work/cruise/checkouts/uclinux-dist/user/e2fsprogs/build-e2fsprogs-1.40.9/lib/uuid'

making all in lib/blkid

make[5]: Entering directory `/home/test/work/cruise/checkouts/uclinux-dist/user/e2fsprogs/build-e2fsprogs-1.40.9/lib/blkid'

make[5]: Nothing to be done for `all'.

make[5]: Leaving directory `/home/test/work/cruise/checkouts/uclinux-dist/user/e2fsprogs/build-e2fsprogs-1.40.9/lib/blkid'

making all in intl

make[5]: Entering directory `/home/test/work/cruise/checkouts/uclinux-dist/user/e2fsprogs/build-e2fsprogs-1.40.9/intl'

make[5]: Nothing to be done for `all'.

make[5]: Leaving directory `/home/test/work/cruise/checkouts/uclinux-dist/user/e2fsprogs/build-e2fsprogs-1.40.9/intl'

making install in e2fsck

make[5]: Entering directory `/home/test/work/cruise/checkouts/uclinux-dist/user/e2fsprogs/build-e2fsprogs-1.40.9/e2fsck'

        LD e2fsck

util.o: In function `init_resource_track':

../../e2fsprogs-1.40.9/e2fsck/util.c:285: undefined reference to `_sbrk'

util.o: In function `print_resource_track':

../../e2fsprogs-1.40.9/e2fsck/util.c:336: undefined reference to `_sbrk'

collect2: ld returned 1 exit status

make[5]: *** [e2fsck] Error 1

make[5]: Leaving directory `/home/test/work/cruise/checkouts/uclinux-dist/user/e2fsprogs/build-e2fsprogs-1.40.9/e2fsck'

make[4]: *** [install-progs-recursive] Error 1

make[4]: Leaving directory `/home/test/work/cruise/checkouts/uclinux-dist/user/e2fsprogs/build-e2fsprogs-1.40.9'

make[3]: *** [all] Error 2

make[3]: Leaving directory `/home/test/work/cruise/checkouts/uclinux-dist/user/e2fsprogs'

make[2]: *** [e2fsprogs] Error 2

make[2]: Leaving directory `/home/test/work/cruise/checkouts/uclinux-dist/user'

make[1]: *** [all] Error 2

make[1]: Leaving directory `/home/test/work/cruise/checkouts/uclinux-dist/user'

make: *** [subdirs] Error 1

 

Follow-ups

 

--- Mike Frysinger                                           2008-08-19 10:58:20

dont build trunk with 2008R1 toolchain

 

--- Mingquan Pan                                             2008-08-20 04:21:36

Ok,close it.

 

 

 

    Files

    Changes

    Commits

    Dependencies

    Duplicates

    Associations

    Tags

 

File Name     File Type     File Size     Posted By

No Files Were Found

Attachments

    Outcomes