[#4332] can4linux compiling fails in svn trunk 2.6.26.2 kernel.

Document created by Aaronwu Employee on Aug 29, 2013
Version 1Show Document
  • View in full screen mode

[#4332] can4linux compiling fails in svn trunk 2.6.26.2 kernel.

Submitted By: Bryan Wu

Open Date

2008-08-08 23:46:20     Close Date

2008-08-09 01:09:32

Priority:

Medium     Assignee:

Bryan Wu

Status:

Closed     Fixed In Release:

N/A

Found In Release:

N/A     Release:

Category:

N/A     Board:

N/A

Processor:

N/A     Silicon Revision:

Is this bug repeatable?:

Yes     Resolution:

N/A

Uboot version or rev.:

    Toolchain version or rev.:

App binary format:

N/A     

Summary: can4linux compiling fails in svn trunk 2.6.26.2 kernel.

Details:

 

  CC [M]  drivers/char/can4linux/core.o

drivers/char/can4linux/core.c: In function 'can_init':

drivers/char/can4linux/core.c:339: error: implicit declaration of function 'class_device_create'

drivers/char/can4linux/core.c:467: warning: label 'out_class' defined but not used

drivers/char/can4linux/core.c: In function 'can_exit':

drivers/char/can4linux/core.c:540: error: implicit declaration of function 'class_device_destroy'

make[3]: *** [drivers/char/can4linux/core.o] Error 1

make[2]: *** [drivers/char/can4linux] Error 2

make[1]: *** [drivers/char] Error 2

make: *** [drivers] Error 2

 

Follow-ups

 

--- Bryan Wu                                                 2008-08-09 02:09:36

fixed, so close it.

 

-Bryan

 

 

 

    Files

    Changes

    Commits

    Dependencies

    Duplicates

    Associations

    Tags

 

File Name     File Type     File Size     Posted By

No Files Were Found

Attachments

    Outcomes