[#4235] Built of xenomai fails on BF561-EZKIT in 08r1.5

Document created by Aaronwu Employee on Aug 29, 2013
Version 1Show Document
  • View in full screen mode

[#4235] Built of xenomai fails on BF561-EZKIT in 08r1.5

Submitted By: Vivi Li

Open Date

2008-07-13 23:13:59     Close Date

2008-07-15 03:54:52

Priority:

Medium     Assignee:

Yi Li

Status:

Closed     Fixed In Release:

N/A

Found In Release:

N/A     Release:

Category:

N/A     Board:

N/A

Processor:

N/A     Silicon Revision:

Is this bug repeatable?:

Yes     Resolution:

Fixed

Uboot version or rev.:

    Toolchain version or rev.:

08r1.5-13

App binary format:

N/A     

Summary: Built of xenomai fails on BF561-EZKIT in 08r1.5

Details:

 

Built of xenomai fails on BF561-EZKIT in 08r1.5.

Bellow is the log.

 

--

  AS      arch/blackfin/lib/memchr.o^M

  AS      arch/blackfin/lib/memcmp.o^M

  AS      arch/blackfin/lib/memcpy.o^M

  AS      arch/blackfin/lib/memmove.o^M

  AS      arch/blackfin/lib/memset.o^M

  AS      arch/blackfin/lib/outs.o^M

  CC      arch/blackfin/lib/strcmp.o^M

  CC      arch/blackfin/lib/strcpy.o^M

  CC      arch/blackfin/lib/strncmp.o^M

  CC      arch/blackfin/lib/strncpy.o^M

  AS      arch/blackfin/lib/udivsi3.o^M

  AR      arch/blackfin/lib/lib.a^M

  GEN     .version^M

  CHK     include/linux/compile.h^M

  UPD     include/linux/compile.h^M

  CC      init/version.o^M

  LD      init/built-in.o^M

  LD      .tmp_vmlinux1^M

arch/blackfin/kernel/built-in.o: In function `time_init':^M

(.init.text+0x8a8): undefined reference to `bfin_read_TIMER_STATUS'^M

arch/blackfin/kernel/built-in.o: In function `time_init':^M

(.init.text+0x90e): undefined reference to `bfin_read_TIMER_STATUS'^M

make[3]: *** [.tmp_vmlinux1] Error 1^M

make[3]: Leaving directory `/home/test/work/cruise/checkouts/uclinux-dist/linux-2.6.x'^M

make[2]: *** [image] Error 2^M

make[2]: Leaving directory `/home/test/work/cruise/checkouts/uclinux-dist/vendors/AnalogDevices/BF561-EZKIT'^M

make[1]: *** [image] Error 2^M

make[1]: Leaving directory `/home/test/work/cruise/checkouts/uclinux-dist/vendors'^M

make: *** [image] Error 2^M

--

 

Follow-ups

 

--- Yi Li                                                    2008-07-14 05:01:15

fix on branch.

 

--- Vivi Li                                                  2008-07-15 03:54:52

OK now. Close it.

Thanks!

 

 

 

    Files

    Changes

    Commits

    Dependencies

    Duplicates

    Associations

    Tags

 

File Name     File Type     File Size     Posted By

No Files Were Found

Attachments

    Outcomes