[#4192] trunk head kernel build fails at irqchip.c

Document created by Aaronwu Employee on Aug 29, 2013
Version 1Show Document
  • View in full screen mode

[#4192] trunk head kernel build fails at irqchip.c

Submitted By: Mingquan Pan

Open Date

2008-06-24 03:27:40     Close Date

2008-06-25 04:53:38

Priority:

Medium     Assignee:

Jie Zhang

Status:

Closed     Fixed In Release:

N/A

Found In Release:

N/A     Release:

Category:

N/A     Board:

N/A

Processor:

N/A     Silicon Revision:

Is this bug repeatable?:

Yes     Resolution:

Fixed

Uboot version or rev.:

    Toolchain version or rev.:

08r1-8

App binary format:

N/A     

Summary: trunk head kernel build fails at irqchip.c

Details:

 

trunk head kernel build fails at irqchip.c now.

 

  CC      init/do_mounts_rd.o^M

  CC      init/do_mounts_initrd.o^M

  LD      init/mounts.o^M

  CC      init/initramfs.o^M

  CC      init/calibrate.o^M

  LD      init/built-in.o^M

  HOSTCC  usr/gen_init_cpio^M

  GEN     usr/initramfs_data.cpio.gz^M

  AS      usr/initramfs_data.o^M

  LD      usr/built-in.o^M

  AS      arch/blackfin/kernel/entry.o^M

  CC      arch/blackfin/kernel/process.o^M

  CC      arch/blackfin/kernel/bfin_ksyms.o^M

  CC      arch/blackfin/kernel/ptrace.o^M

  CC      arch/blackfin/kernel/setup.o^M

  CC      arch/blackfin/kernel/signal.o^M

  CC      arch/blackfin/kernel/sys_bfin.o^M

  CC      arch/blackfin/kernel/traps.o^M

  CC      arch/blackfin/kernel/irqchip.o^M

arch/blackfin/kernel/irqchip.c:67: error: expected 鈥榼鈥�before 鈥�鈥�token^M

make[2]: *** [arch/blackfin/kernel/irqchip.o] Error 1^M

make[1]: *** [arch/blackfin/kernel] Error 2^M

make[1]: Leaving directory `/home/test/work/cruise/checkouts/uclinux-dist/linux-2.6.x'^M

make: *** [linux] Error 1^M

 

 

Follow-ups

 

--- Mingquan Pan                                             2008-06-25 05:53:38

Fixed,close.

 

 

 

    Files

    Changes

    Commits

    Dependencies

    Duplicates

    Associations

    Tags

 

File Name     File Type     File Size     Posted By

No Files Were Found

Attachments

    Outcomes