[#4190] Build kernel failed in trunk at irqchip.c on all platform

Document created by Aaronwu Employee on Aug 29, 2013
Version 1Show Document
  • View in full screen mode

[#4190] Build kernel failed in trunk at irqchip.c on all platform

Submitted By: Vivi Li

Open Date

2008-06-24 00:50:37     Close Date

2008-06-24 23:22:03

Priority:

Medium     Assignee:

Jie Zhang

Status:

Closed     Fixed In Release:

N/A

Found In Release:

N/A     Release:

Category:

N/A     Board:

N/A

Processor:

N/A     Silicon Revision:

Is this bug repeatable?:

Yes     Resolution:

Duplicate

Uboot version or rev.:

    Toolchain version or rev.:

08r1-8

App binary format:

N/A     

Summary: Build kernel failed in trunk at irqchip.c on all platform

Details:

 

Build kernel failed in trunk at irqchip.c on all platform.

 

--

make[1]: Entering directory `/home/test/work/cruise/checkouts/uclinux-dist/linux-2.6.x'^M

  SYMLINK include/asm-blackfin/mach-bf533 -> include/asm-blackfin/mach^M

  CHK     include/linux/version.h^M

  CHK     include/linux/utsrelease.h^M

  UPD     include/linux/utsrelease.h^M

  SYMLINK include/asm -> include/asm-blackfin^M

  CC      arch/blackfin/kernel/asm-offsets.s^M

  GEN     include/asm-blackfin/asm-offsets.h^M

  CALL    scripts/checksyscalls.sh^M

  CC      scripts/mod/empty.o^M

  HOSTCC  scripts/mod/mk_elfconfig^M

  MKELF   scripts/mod/elfconfig.h^M

  HOSTCC  scripts/mod/file2alias.o^M

  HOSTCC  scripts/mod/modpost.o^M

  HOSTCC  scripts/mod/sumversion.o^M

  HOSTLD  scripts/mod/modpost^M

  HOSTCC  scripts/kallsyms^M

  HOSTCC  scripts/bin2c^M

  CC      init/main.o^M

  CHK     include/linux/compile.h^M

  UPD     include/linux/compile.h^M

  CC      init/version.o^M

  CC      init/do_mounts.o^M

  CC      init/do_mounts_rd.o^M

  CC      init/do_mounts_initrd.o^M

  LD      init/mounts.o^M

  CC      init/initramfs.o^M

  CC      init/calibrate.o^M

  LD      init/built-in.o^M

  HOSTCC  usr/gen_init_cpio^M

  GEN     usr/initramfs_data.cpio.gz^M

  AS      usr/initramfs_data.o^M

  LD      usr/built-in.o^M

  AS      arch/blackfin/kernel/entry.o^M

  CC      arch/blackfin/kernel/process.o^M

  CC      arch/blackfin/kernel/bfin_ksyms.o^M

  CC      arch/blackfin/kernel/ptrace.o^M

  CC      arch/blackfin/kernel/setup.o^M

  CC      arch/blackfin/kernel/signal.o^M

  CC      arch/blackfin/kernel/sys_bfin.o^M

  CC      arch/blackfin/kernel/traps.o^M

  CC      arch/blackfin/kernel/irqchip.o^M

arch/blackfin/kernel/irqchip.c:67: error: expected ‘}’ before ‘;’ token

make[2]: *** [arch/blackfin/kernel/irqchip.o] Error 1^M

make[1]: *** [arch/blackfin/kernel] Error 2^M

make[1]: Leaving directory `/home/test/work/cruise/checkouts/uclinux-dist/linux-2.6.x'^M

make: *** [linux] Error 1^M

--

 

Follow-ups

 

--- Sonic Zhang                                              2008-06-25 00:22:01

Duplicated bug of 4192.

 

 

 

    Files

    Changes

    Commits

    Dependencies

    Duplicates

    Associations

    Tags

 

File Name     File Type     File Size     Posted By

No Files Were Found

Attachments

    Outcomes