[#4098] trunk kernel build fails at checksum.c

Document created by Aaronwu Employee on Aug 28, 2013
Version 1Show Document
  • View in full screen mode

[#4098] trunk kernel build fails at checksum.c

Submitted By: Mingquan Pan

Open Date

2008-05-11 22:16:45     Close Date

2008-05-12 00:19:17

Priority:

Medium     Assignee:

Nobody

Status:

Closed     Fixed In Release:

N/A

Found In Release:

N/A     Release:

Category:

N/A     Board:

N/A

Processor:

N/A     Silicon Revision:

Is this bug repeatable?:

Yes     Resolution:

N/A

Uboot version or rev.:

    Toolchain version or rev.:

08r1-8

App binary format:

N/A     

Summary: trunk kernel build fails at checksum.c

Details:

 

trunk kernel build fails at checksum.c now.

 

  CC      lib/string.o^M

  CC      lib/vsprintf.o^M

  AR      lib/lib.a^M

  CC [M]  lib/crc-ccitt.o^M

  LD      arch/blackfin/lib/built-in.o^M

  CC      arch/blackfin/lib/ashldi3.o^M

  CC      arch/blackfin/lib/ashrdi3.o^M

  CC      arch/blackfin/lib/checksum.o^M

arch/blackfin/lib/checksum.c:113: error: conflicting types for 鈥榠p_compute_csum鈥^M

include/asm/checksum.h:98: error: previous declaration of 鈥榠p_compute_csum鈥�was here^M

make[2]: *** [arch/blackfin/lib/checksum.o] Error 1^M

make[1]: *** [arch/blackfin/lib] Error 2^M

make[1]: Leaving directory `/home/test/work/cruise/checkouts/uclinux-dist/linux-2.6.x'^M

make: *** [linux] Error 1^M

 

Follow-ups

 

--- Mingquan Pan                                             2008-05-12 00:19:16

Fixed. Close.

 

 

 

    Files

    Changes

    Commits

    Dependencies

    Duplicates

    Associations

    Tags

 

File Name     File Type     File Size     Posted By

No Files Were Found

Attachments

    Outcomes