[#4047] Build kernel failed in trunk at pata for BF548-EZKIT.

Document created by Aaronwu Employee on Aug 28, 2013
Version 1Show Document
  • View in full screen mode

[#4047] Build kernel failed in trunk at pata for BF548-EZKIT.

Submitted By: Vivi Li

Open Date

2008-04-21 02:14:24     Close Date

2008-04-22 03:54:15

Priority:

Medium     Assignee:

Sonic Zhang

Status:

Closed     Fixed In Release:

N/A

Found In Release:

N/A     Release:

Category:

N/A     Board:

N/A

Processor:

N/A     Silicon Revision:

Is this bug repeatable?:

Yes     Resolution:

Fixed

Uboot version or rev.:

    Toolchain version or rev.:

08r1-rc8

App binary format:

N/A     

Summary: Build kernel failed in trunk at pata for BF548-EZKIT.

Details:

 

Build kernel failed in trunk at pata for BF548-EZKIT. Below is the log:

 

--

drivers/ata/pata_bf54x.c: In function ‘bfin_ata_host_intr’:

drivers/ata/pata_bf54x.c:1357: error: ‘struct ata_port’ has no member named ‘eh_info’

drivers/ata/pata_bf54x.c: In function ‘bfin_ata_interrupt’:

drivers/ata/pata_bf54x.c:1458: error: ‘struct ata_port’ has no member named ‘active_tag’

make[3]: *** [drivers/ata/pata_bf54x.o] Error 1

make[2]: *** [drivers/ata] Error 2

--

 

Follow-ups

 

--- Sonic Zhang                                              2008-04-21 02:58:33

Fixed

 

--- Vivi Li                                                  2008-04-21 22:57:29

It still fails at pata with new error info:

 

--

  CC      drivers/ata/pata_bf54x.o^M

drivers/ata/pata_bf54x.c: In function ‘bfin_ata_interrupt’:^M

drivers/ata/pata_bf54x.c:1458: error: ‘struct ata_port’ has no member named

‘active_tag’^M

make[3]: *** [drivers/ata/pata_bf54x.o] Error 1^M

make[2]: *** [drivers/ata] Error 2^M

--

 

--- Sonic Zhang                                              2008-04-21 23:03:51

Fixed

 

--- Vivi Li                                                  2008-04-22 03:54:15

It can build now. Close it.

 

 

 

    Files

    Changes

    Commits

    Dependencies

    Duplicates

    Associations

    Tags

 

File Name     File Type     File Size     Posted By

No Files Were Found

Attachments

    Outcomes