[#4037] Building kernel failed in trunk with lib ncurses in FDPIC format

Document created by Aaronwu Employee on Aug 28, 2013
Version 1Show Document
  • View in full screen mode

[#4037] Building kernel failed in trunk with lib ncurses in FDPIC format

Submitted By: Vivi Li

Open Date

2008-04-16 04:00:08     Close Date

2008-04-16 10:48:55

Priority:

Medium     Assignee:

Nobody

Status:

Closed     Fixed In Release:

N/A

Found In Release:

N/A     Release:

Category:

N/A     Board:

N/A

Processor:

N/A     Silicon Revision:

Is this bug repeatable?:

Yes     Resolution:

Duplicate

Uboot version or rev.:

    Toolchain version or rev.:

08r1-rc8

App binary format:

N/A     

Summary: Building kernel failed in trunk with lib ncurses in FDPIC format

Details:

 

Build kernel with lib ncurses in FDPIC format, it failed when copy libncurses.so.5 in staging/usr/lib.

 

--

romfs-inst.sh -e CONFIG_FMT_USE_FDPIC_ELF /home/test/work/cruise/checkouts/uclinux-dist/staging/usr/lib/libncurses.so.5 /lib/

cp: cannot stat `/home/test/work/cruise/checkouts/uclinux-dist/staging/usr/lib/libncurses.so.5': No such file or directory

make[2]: *** [romfs] Error 1

make[2]: Leaving directory `/home/test/work/cruise/checkouts/uclinux-dist/lib/ncurses'

make[1]: *** [romfs] Error 2

make[1]: Leaving directory `/home/test/work/cruise/checkouts/uclinux-dist/lib'

make: *** [romfs.subdirs] Error 1

--

 

Follow-ups

 

--- Mike Frysinger                                           2008-04-16 10:48:54

dupe of [#4032]

 

 

 

    Files

    Changes

    Commits

    Dependencies

    Duplicates

    Associations

    Tags

 

File Name     File Type     File Size     Posted By

No Files Were Found

Attachments

    Outcomes