[#4031] build microwin fails on bf548 ezkit

Document created by Aaronwu Employee on Aug 28, 2013
Version 1Show Document
  • View in full screen mode

[#4031] build microwin fails on bf548 ezkit

Submitted By: Mingquan Pan

Open Date

2008-04-14 04:54:43     Close Date

2008-04-15 00:25:05

Priority:

Medium     Assignee:

Yi Li

Status:

Closed     Fixed In Release:

N/A

Found In Release:

N/A     Release:

Category:

N/A     Board:

N/A

Processor:

N/A     Silicon Revision:

Is this bug repeatable?:

Yes     Resolution:

Fixed

Uboot version or rev.:

    Toolchain version or rev.:

08r1-8

App binary format:

N/A     

Summary: build microwin fails on bf548 ezkit

Details:

 

build microwin fails on bf548 ezkit now.

 

installing ../../e2fsprogs-1.40.8/po/es.gmo as /home/test/work/cruise/checkouts/uclinux-dist/staging/usr/share/locale/es/LC_MESSAGES/e2fsprogs.mo

Compiling engine/selfont.c ...

Compiling engine/devstipple.c ...

installing ../../e2fsprogs-1.40.8/po/fr.gmo as /home/test/work/cruise/checkouts/uclinux-dist/staging/usr/share/locale/fr/LC_MESSAGES/e2fsprogs.mo

Compiling engine/error.c ...

installing ../../e2fsprogs-1.40.8/po/it.gmo as /home/test/work/cruise/checkouts/uclinux-dist/staging/usr/share/locale/it/LC_MESSAGES/e2fsprogs.mo

Compiling engine/devrgn2.c ...

Compiling engine/font_dbcs.c ...

installing ../../e2fsprogs-1.40.8/po/nl.gmo as /home/test/work/cruise/checkouts/uclinux-dist/staging/usr/share/locale/nl/LC_MESSAGES/e2fsprogs.mo

Compiling engine/font_freetype2.c ...

Compiling engine/devarc.c ...

/home/test/work/cruise/checkouts/uclinux-dist/user/microwin/src/engine/font_freetype2.c:57:22: error: ft2build.h: No such file or directory

/home/test/work/cruise/checkouts/uclinux-dist/user/microwin/src/engine/font_freetype2.c:58:10: error: #include expects "FILENAME" or <FILENAME>

/home/test/work/cruise/checkouts/uclinux-dist/user/microwin/src/engine/font_freetype2.c:59:10: error: #include expects "FILENAME" or <FILENAME>

/home/test/work/cruise/checkouts/uclinux-dist/user/microwin/src/engine/font_freetype2.c:60:10: error: #include expects "FILENAME" or <FILENAME>

/home/test/work/cruise/checkouts/uclinux-dist/user/microwin/src/engine/font_freetype2.c:145:11: error: #include expects "FILENAME" or <FILENAME>

/home/test/work/cruise/checkouts/uclinux-dist/user/microwin/src/engine/font_freetype2.c:146:11: error: #include expects "FILENAME" or <FILENAME>

/home/test/work/cruise/checkouts/uclinux-dist/user/microwin/src/engine/font_freetype2.c:196: error: expected specifier-qualifier-list before 鈥楩TC_ImageDesc鈥

/home/test/work/cruise/checkouts/uclinux-dist/user/microwin/src/engine/font_freetype2.c:245: error: expected 鈥�鈥� 鈥�鈥� 鈥�鈥� 鈥榓sm鈥�or 鈥榑_attribute__鈥�before 鈥榝reetype2_library鈥

/home/test/work/cruise/checkouts/uclinux-dist/user/microwin/src/engine/font_freetype2.c:261: error: expected 鈥�鈥� 鈥�鈥� 鈥�鈥� 鈥榓sm鈥�or 鈥榑_attribute__鈥�before 鈥榝reetype2_cache_manager鈥

/home/test/work/cruise/checkouts/uclinux-dist/user/microwin/src/engine/font_freetype2.c:266: error: expected 鈥�鈥� 鈥�鈥� 鈥�鈥� 鈥榓sm鈥�or 鈥榑_attribute__鈥�before 鈥榝reetype2_cache_sbit鈥

/home/test/work/cruise/checkouts/uclinux-dist/user/microwin/src/engine/font_freetype2.c:307: error: expected 鈥�鈥� 鈥�鈥� 鈥�鈥� 鈥榓sm鈥�or 鈥榑_attribute__鈥�before 鈥榝reetype2_face_requester鈥

/home/test/work/cruise/checkouts/uclinux-dist/user/microwin/src/engine/font_freetype2.c: In function 鈥榝reetype_init鈥�

/home/test/work/cruise/checkouts/uclinux-dist/user/microwin/src/engine/font_freetype2.c:365: error: 鈥楩T_Error鈥�undeclared (first use in this function)

/home/test/work/cruise/checkouts/uclinux-dist/user/microwin/src/engine/font_freetype2.c:365: error: (Each undeclared identifier is reported only once

installing ../../e2fsprogs-1.40.8/po/pl.gmo as /home/test/work/cruise/checkouts/uclinux-dist/staging/usr/share/locale/pl/LC_MESSAGES/e2fsprogs.mo

/home/test/work/cruise/checkouts/uclinux-dist/user/microwin/src/engine/font_freetype2.c:365: error: for each function it appears in.)

/home/test/work/cruise/checkouts/uclinux-dist/user/microwin/src/engine/font_freetype2.c:365: error: expected 鈥�鈥�before 鈥榚rr鈥

/home/test/work/cruise/checkouts/uclinux-dist/user/microwin/src/engine/font_freetype2.c:367: error: 鈥榝reetype2_library鈥�undeclared (first use in this function)

/home/test/work/cruise/checkouts/uclinux-dist/user/microwin/src/engine/font_freetype2.c:374: error: 鈥榚rr鈥�undeclared (first use in this function)

/home/test/work/cruise/checkouts/uclinux-dist/user/microwin/src/engine/font_freetype2.c:374: warning: implicit declaration of function 鈥楩T_Init_FreeType 鈥

/home/test/work/cruise/checkouts/uclinux-dist/user/microwin/src/engine/font_freetype2.c:376: error: 鈥楩T_Err_Ok鈥�undeclared (first use in this function)

/home/test/work/cruise/checkouts/uclinux-dist/user/microwin/src/engine/font_freetype2.c:383: warning: implicit declaration of function 鈥楩TC_Manager_New鈥

/home/test/work/cruise/checkouts/uclinux-dist/user/microwin/src/engine/font_freetype2.c:386: error: 鈥榝reetype2_face_requester鈥�undeclared (first use in this function)

/home/test/work/cruise/checkouts/uclinux-dist/user/microwin/src/engine/font_freetype2.c:387: error: 鈥榝reetype2_cache_manager鈥�undeclared (first use in this function)

/home/test/work/cruise/checkouts/uclinux-dist/user/microwin/src/engine/font_freetype2.c:393: warning: implicit declaration of function 鈥楩T_Done_FreeType 鈥

/home/test/work/cruise/checkouts/uclinux-dist/user/microwin/src/engine/font_freetype2.c:398: warning: implicit declaration of function 鈥楩TC_SBitCache_New鈥

/home/test/work/cruise/checkouts/uclinux-dist/user/microwin/src/engine/font_freetype2.c:399: error: 鈥榝reetype2_cache_sbit鈥�undeclared (first use in this function)

/home/test/work/cruise/checkouts/uclinux-dist/user/microwin/src/engine/font_freetype2.c:404: warning: implicit declaration of function 鈥楩TC_Manager_Done 鈥

/home/test/work/cruise/checkouts/uclinux-dist/user/microwin/src/engine/font_freetype2.c: In function 鈥榝reetype2_createfont_internal鈥�

/home/test/work/cruise/checkouts/uclinux-dist/user/microwin/src/engine/font_freetype2.c:598: error: 鈥楩T_Face鈥�undeclared (first use in this function)

/home/test/work/cruise/checkouts/uclinux-dist/user/microwin/src/engine/font_freetype2.c:598: error: expected 鈥�鈥�before 鈥榝ace鈥

/home/test/work/cruise/checkouts/uclinux-dist/user/microwin/src/engine/font_freetype2.c:599: error: 鈥楩T_Size鈥�undeclared (first use in this function)

/home/test/work/cruise/checkouts/uclinux-dist/user/microwin/src/engine/font_freetype2.c:599: error: expected 鈥�鈥�before 鈥榮ize鈥

/home/test/work/cruise/checkouts/uclinux-dist/user/microwin/src/engine/font_freetype2.c:601: error: 鈥楩T_Error鈥�undeclared (first use in this function)

/home/test/work/cruise/checkouts/uclinux-dist/user/microwin/src/engine/font_freetype2.c:601: error: expected 鈥�鈥�before 鈥榚rror鈥

/home/test/work/cruise/checkouts/uclinux-dist/user/microwin/src/engine/font_freetype2.c:613: error: 鈥楳WFREETYPE2FONT鈥�has no member named 鈥榠magedesc鈥

/home/test/work/cruise/checkouts/uclinux-dist/user/microwin/src/engine/font_freetype2.c:614: error: 鈥楳WFREETYPE2FONT鈥�has no member named 鈥榠magedesc鈥

/home/test/work/cruise/checkouts/uclinux-dist/user/microwin/src/engine/font_freetype2.c:615: error: 鈥楳WFREETYPE2FONT鈥�has no member named 鈥榠magedesc鈥

/home/test/work/cruise/checkouts/uclinux-dist/user/microwin/src/engine/font_freetype2.c:619: error: 鈥楳WFREETYPE2FONT鈥�has no member named 鈥榠magedesc鈥

/home/test/work/cruise/checkouts/uclinux-dist/user/microwin/src/engine/font_freetype2.c:662: error: 鈥榚rror鈥�undeclared (first use in this function)

/home/test/work/cruise/checkouts/uclinux-dist/user/microwin/src/engine/font_freetype2.c:662: warning: implicit declaration of function 鈥楩TC_Manager_Lookup_Size鈥

/home/test/work/cruise/checkouts/uclinux-dist/user/microwin/src/engine/font_freetype2.c:662: error: 鈥榝reetype2_cache_manager鈥�undeclared (first use in this function)

/home/test/work/cruise/checkouts/uclinux-dist/user/microwin/src/engine/font_freetype2.c:663: error: 鈥楳WFREETYPE2FONT鈥�has no member named 鈥榠magedesc鈥

/home/test/work/cruise/checkouts/uclinux-dist/user/microwin/src/engine/font_freetype2.c:663: error: 鈥榝ace鈥�undeclared (first use in this function)

/home/test/work/cruise/checkouts/uclinux-dist/user/microwin/src/engine/font_freetype2.c:663: error: 鈥榮ize鈥�undeclared (first use in this function)

/home/test/work/cruise/checkouts/uclinux-dist/user/microwin/src/engine/font_freetype2.c:664: error: 鈥楩T_Err_Ok鈥�undeclared (first use in this function)

/home/test/work/cruise/checkouts/uclinux-dist/user/microwin/src/engine/font_freetype2.c: In function 鈥榝reetype2_destroyfont鈥�

/home/test/work/cruise/checkouts/uclinux-dist/user/microwin/src/engine/font_freetype2.c:706: warning: implicit declaration of function 鈥楩TC_Manager_Reset鈥

/home/test/work/cruise/checkouts/uclinux-dist/user/microwin/src/engine/font_freetype2.c:706: error: 鈥榝reetype2_cache_manager鈥�undeclared (first use in this function)

/home/test/work/cruise/checkouts/uclinux-dist/user/microwin/src/engine/font_freetype2.c: In function 鈥榝reetype2_setfontsize鈥�

/home/test/work/cruise/checkouts/uclinux-dist/user/microwin/src/engine/font_freetype2.c:808: error: 鈥楳WFREETYPE2FONT鈥�has no member named 鈥榠magedesc鈥

/home/test/work/cruise/checkouts/uclinux-dist/user/microwin/src/engine/font_freetype2.c:809: error: 鈥楳WFREETYPE2FONT鈥�has no member named 鈥榠magedesc鈥

/home/test/work/cruise/checkouts/uclinux-dist/user/microwin/src/engine/font_freetype2.c: In function 鈥榝reetype2_setfontrotation鈥�

/home/test/work/cruise/checkouts/uclinux-dist/user/microwin/src/engine/font_freetype2.c:850: error: 鈥楩T_Angle鈥�undeclared (first use in this function)

/home/test/work/cruise/checkouts/uclinux-dist/user/microwin/src/engine/font_freetype2.c:850: error: expected 鈥�鈥�before 鈥榓ngle鈥

/home/test/work/cruise/checkouts/uclinux-dist/user/microwin/src/engine/font_freetype2.c:851: error: 鈥楩T_Vector鈥�undeclared (first use in this function)

/home/test/work/cruise/checkouts/uclinux-dist/user/microwin/src/engine/font_freetype2.c:851: error: expected 鈥�鈥�before 鈥榮incosvec鈥

/home/test/work/cruise/checkouts/uclinux-dist/user/microwin/src/engine/font_freetype2.c:852: warning: implicit declaration of function 鈥楩T_Vector_Unit鈥

/home/test/work/cruise/checkouts/uclinux-dist/user/microwin/src/engine/font_freetype2.c:852: error: 鈥榮incosvec鈥�undeclared (first use in this function)

/home/test/work/cruise/checkouts/uclinux-dist/user/microwin/src/engine/font_freetype2.c:852: error: 鈥榓ngle鈥�undeclared (first use in this function)

/home/test/work/cruise/checkouts/uclinux-dist/user/microwin/src/engine/font_freetype2.c:853: error: 鈥楳WFREETYPE2FONT鈥�has no member named 鈥榤atrix鈥

/home/test/work/cruise/checkouts/uclinux-dist/user/microwin/src/engine/font_freetype2.c:854: error: 鈥楳WFREETYPE2FONT鈥�has no member named 鈥榤atrix鈥

/home/test/work/cruise/checkouts/uclinux-dist/user/microwin/src/engine/font_freetype2.c:855: error: 鈥楳WFREETYPE2FONT鈥�has no member named 鈥榤atrix鈥

/home/test/work/cruise/checkouts/uclinux-dist/user/microwin/src/engine/font_freetype2.c:856: error: 鈥楳WFREETYPE2FONT鈥�has no member named 鈥榤atrix鈥

/home/test/work/cruise/checkouts/uclinux-dist/user/microwin/src/engine/font_freetype2.c: In function 鈥榝reetype2_setfontattr鈥�

/home/test/work/cruise/checkouts/uclinux-dist/user/microwin/src/engine/font_freetype2.c:884: error: 鈥楳WFREETYPE2FONT鈥�has no member named 鈥榠magedesc鈥

/home/test/work/cruise/checkouts/uclinux-dist/user/microwin/src/engine/font_freetype2.c:885: error: 鈥榝tc_image_grays鈥�undeclared (first use in this function)

/home/test/work/cruise/checkouts/uclinux-dist/user/microwin/src/engine/font_freetype2.c:885: error: 鈥榝tc_image_mono鈥�undeclared (first use in this function)

/home/test/work/cruise/checkouts/uclinux-dist/user/microwin/src/engine/font_freetype2.c: At top level:

/home/test/work/cruise/checkouts/uclinux-dist/user/microwin/src/engine/font_freetype2.c:914: error: expected 鈥�鈥� 鈥�鈥� 鈥�鈥� 鈥榓sm鈥�or 鈥榑_attribute__鈥�before 鈥榝reetype2_get_glyph_size鈥

/home/test/work/cruise/checkouts/uclinux-dist/user/microwin/src/engine/font_freetype2.c:998: error: expected 鈥�鈥� 鈥�鈥� 鈥�鈥� 鈥榓sm鈥�or 鈥榑_attribute__鈥�before 鈥榝reetype2_get_char_size鈥

/home/test/work/cruise/checkouts/uclinux-dist/user/microwin/src/engine/font_freetype2.c: In function 鈥榝reetype2_getfontinfo鈥�

/home/test/work/cruise/checkouts/uclinux-dist/user/microwin/src/engine/font_freetype2.c:1021: error: 鈥楩T_Face鈥�undeclared (first use in this function)

/home/test/work/cruise/checkouts/uclinux-dist/user/microwin/src/engine/font_freetype2.c:1021: error: expected 鈥�鈥�before 鈥榝ace鈥

/home/test/work/cruise/checkouts/uclinux-dist/user/microwin/src/engine/font_freetype2.c:1022: error: 鈥楩T_Size鈥�undeclared (first use in this function)

/home/test/work/cruise/checkouts/uclinux-dist/user/microwin/src/engine/font_freetype2.c:1022: error: expected 鈥�鈥�before 鈥榮ize鈥

/home/test/work/cruise/checkouts/uclinux-dist/user/microwin/src/engine/font_freetype2.c:1023: error: 鈥楩T_BBox鈥�undeclared (first use in this function)

/home/test/work/cruise/checkouts/uclinux-dist/user/microwin/src/engine/font_freetype2.c:1023: error: 鈥榖box鈥�undeclared (first use in this function)

/home/test/work/cruise/checkouts/uclinux-dist/user/microwin/src/engine/font_freetype2.c:1024: error: 鈥楩T_Size_Metrics鈥�undeclared (first use in this function)

/home/test/work/cruise/checkouts/uclinux-dist/user/microwin/src/engine/font_freetype2.c:1024: error: 鈥榤etrics鈥�undeclared (first use in this function)

/home/test/work/cruise/checkouts/uclinux-dist/user/microwin/src/engine/font_freetype2.c:1028: error: 鈥楩T_Error鈥�undeclared (first use in this function)

/home/test/work/cruise/checkouts/uclinux-dist/user/microwin/src/engine/font_freetype2.c:1028: error: expected 鈥�鈥�before 鈥榚rror鈥

/home/test/work/cruise/checkouts/uclinux-dist/user/microwin/src/engine/font_freetype2.c:1039: error: 鈥榚rror鈥�undeclared (first use in this function)

/home/test/work/cruise/checkouts/uclinux-dist/user/microwin/src/engine/font_freetype2.c:1039: error: 鈥榝reetype2_cache_manager鈥�undeclared (first use in this function)

/home/test/work/cruise/checkouts/uclinux-dist/user/microwin/src/engine/font_freetype2.c:1040: error: 鈥楳WFREETYPE2FONT鈥�has no member named 鈥榠magedesc 鈥

/home/test/work/cruise/checkouts/uclinux-dist/user/microwin/src/engine/font_freetype2.c:1040: error: 鈥榝ace鈥�undeclared (first use in this function)

/home/test/work/cruise/checkouts/uclinux-dist/user/microwin/src/engine/font_freetype2.c:1040: error: 鈥榮ize鈥�undeclared (first use in this function)

/home/test/work/cruise/checkouts/uclinux-dist/user/microwin/src/engine/font_freetype2.c:1053: warning: implicit declaration of function 鈥楩T_IS_SCALABLE鈥

/home/test/work/cruise/checkouts/uclinux-dist/user/microwin/src/engine/font_freetype2.c:1062: warning: implicit declaration of function 鈥楩T_MulFix鈥

/home/test/work/cruise/checkouts/uclinux-dist/user/microwin/src/engine/font_freetype2.c:1067: error: 鈥楩T_FACE_FLAG_FIXED_WIDTH鈥�undeclared (first use in this function)

/home/test/work/cruise/checkouts/uclinux-dist/user/microwin/src/engine/font_freetype2.c:1093: warning: implicit declaration of function 鈥榝reetype2_get_char_size鈥

/home/test/work/cruise/checkouts/uclinux-dist/user/microwin/src/engine/font_freetype2.c: In function 鈥榝reetype2_drawtext鈥�

/home/test/work/cruise/checkouts/uclinux-dist/user/microwin/src/engine/font_freetype2.c:1126: error: 鈥楩T_Face鈥�undeclared (first use in this function)

/home/test/work/cruise/checkouts/uclinux-dist/user/microwin/src/engine/font_freetype2.c:1126: error: expected 鈥�鈥�before 鈥榝ace鈥

/home/test/work/cruise/checkouts/uclinux-dist/user/microwin/src/engine/font_freetype2.c:1127: error: 鈥楩T_Size鈥�undeclared (first use in this function)

/home/test/work/cruise/checkouts/uclinux-dist/user/microwin/src/engine/font_freetype2.c:1127: error: expected 鈥�鈥�before 鈥榮ize鈥

/home/test/work/cruise/checkouts/uclinux-dist/user/microwin/src/engine/font_freetype2.c:1129: error: 鈥楩T_Vector鈥�undeclared (first use in this function)

/home/test/work/cruise/checkouts/uclinux-dist/user/microwin/src/engine/font_freetype2.c:1129: error: expected 鈥�鈥�before 鈥榩os鈥

/home/test/work/cruise/checkouts/uclinux-dist/user/microwin/src/engine/font_freetype2.c:1131: error: 鈥楩T_Glyph鈥�undeclared (first use in this function)

/home/test/work/cruise/checkouts/uclinux-dist/user/microwin/src/engine/font_freetype2.c:1131: error: expected 鈥�鈥�before 鈥榞lyph鈥

/home/test/work/cruise/checkouts/uclinux-dist/user/microwin/src/engine/font_freetype2.c:1132: error: 鈥楩T_Error鈥�undeclared (first use in this function)

/home/test/work/cruise/checkouts/uclinux-dist/user/microwin/src/engine/font_freetype2.c:1132: error: expected 鈥�鈥�before 鈥榚rror鈥

/home/test/work/cruise/checkouts/uclinux-dist/user/microwin/src/engine/font_freetype2.c:1133: error: expected 鈥�鈥�before 鈥榢erning_delta鈥

/home/test/work/cruise/checkouts/uclinux-dist/user/microwin/src/engine/font_freetype2.c:1147: error: 鈥榚rror鈥�undeclared (first use in this function)

/home/test/work/cruise/checkouts/uclinux-dist/user/microwin/src/engine/font_freetype2.c:1147: error: 鈥榝reetype2_cache_manager鈥�undeclared (first use in this function)

/home/test/work/cruise/checkouts/uclinux-dist/user/microwin/src/engine/font_freetype2.c:1148: error: 鈥楳WFREETYPE2FONT鈥�has no member named 鈥榠magedesc 鈥

/home/test/work/cruise/checkouts/uclinux-dist/user/microwin/src/engine/font_freetype2.c:1148: error: 鈥榝ace鈥�undeclared (first use in this function)

/home/test/work/cruise/checkouts/uclinux-dist/user/microwin/src/engine/font_freetype2.c:1148: error: 鈥榮ize鈥�undeclared (first use in this function)

/home/test/work/cruise/checkouts/uclinux-dist/user/microwin/src/engine/font_freetype2.c:1159: warning: implicit declaration of function 鈥楩T_HAS_KERNING鈥

/home/test/work/cruise/checkouts/uclinux-dist/user/microwin/src/engine/font_freetype2.c:1180: error: 鈥榩os鈥�undeclared (first use in this function)

/home/test/work/cruise/checkouts/uclinux-dist/user/microwin/src/engine/font_freetype2.c:1196: error: 鈥楩T_BitmapGlyph鈥�undeclared (first use in this function)

/home/test/work/cruise/checkouts/uclinux-dist/user/microwin/src/engine/font_freetype2.c:1196: error: expected 鈥�鈥�before 鈥榖itmapglyph鈥

/home/test/work/cruise/checkouts/uclinux-dist/user/microwin/src/engine/font_freetype2.c:1197: error: 鈥楩T_Bitmap鈥�undeclared (first use in this function)

  ...

/home/test/work/cruise/checkouts/uclinux-dist/user/microwin/src/engine/font_freetype2.c:1383: error: 鈥榝reetype2_cache_manager鈥�undeclared (first use in this function)

/home/test/work/cruise/checkouts/uclinux-dist/user/microwin/src/engine/font_freetype2.c:1384: error: 鈥楳WFREETYPE2FONT鈥�has no member named 鈥榠magedesc 鈥

/home/test/work/cruise/checkouts/uclinux-dist/user/microwin/src/engine/font_freetype2.c:1384: error: 鈥榝ace鈥�undeclared (first use in this function)

/home/test/work/cruise/checkouts/uclinux-dist/user/microwin/src/engine/font_freetype2.c:1384: error: 鈥榮ize鈥�undeclared (first use in this function)

/home/test/work/cruise/checkouts/uclinux-dist/user/microwin/src/engine/font_freetype2.c:1399: error: 鈥榖box鈥�undeclared (first use in this function)

/home/test/work/cruise/checkouts/uclinux-dist/user/microwin/src/engine/font_freetype2.c:1407: error: 鈥榩os鈥�undeclared (first use in this function)

/home/test/work/cruise/checkouts/uclinux-dist/user/microwin/src/engine/font_freetype2.c:1415: error: 鈥榝t_kerning_default鈥�undeclared (first use in this function)

/home/test/work/cruise/checkouts/uclinux-dist/user/microwin/src/engine/font_freetype2.c:1415: error: 鈥榢erning_delta鈥�undeclared (first use in this function)

/home/test/work/cruise/checkouts/uclinux-dist/user/microwin/src/engine/font_freetype2.c:1424: error: 鈥楩T_LOAD_DEFAULT鈥�undeclared (first use in this function)

/home/test/work/cruise/checkouts/uclinux-dist/user/microwin/src/engine/font_freetype2.c:1428: error: 鈥榞lyph鈥�undeclared (first use in this function)

/home/test/work/cruise/checkouts/uclinux-dist/user/microwin/src/engine/font_freetype2.c:1442: error: 鈥楳WFREETYPE2FONT鈥�has no member named 鈥榤atrix鈥

/home/test/work/cruise/checkouts/uclinux-dist/user/microwin/src/engine/font_freetype2.c:1446: warning: implicit declaration of function 鈥楩T_Glyph_Get_CBox鈥

/home/test/work/cruise/checkouts/uclinux-dist/user/microwin/src/engine/font_freetype2.c:1446: error: 鈥榝t_glyph_bbox_pixels鈥�undeclared (first use in this function)

/home/test/work/cruise/checkouts/uclinux-dist/user/microwin/src/engine/font_freetype2.c:1449: error: 鈥榞lyph_bbox鈥�undeclared (first use in this function)

/home/test/work/cruise/checkouts/uclinux-dist/user/microwin/src/engine/font_freetype2.c: In function 鈥榝reetype2_gettextsize_fast鈥�

/home/test/work/cruise/checkouts/uclinux-dist/user/microwin/src/engine/font_freetype2.c:1502: error: 鈥楩T_Face鈥�undeclared (first use in this function)

/home/test/work/cruise/checkouts/uclinux-dist/user/microwin/src/engine/font_freetype2.c:1502: error: expected 鈥�鈥�before 鈥榝ace鈥

/home/test/work/cruise/checkouts/uclinux-dist/user/microwin/src/engine/font_freetype2.c:1503: error: 鈥楩T_Size鈥�undeclared (first use in this function)

/home/test/work/cruise/checkouts/uclinux-dist/user/microwin/src/engine/font_freetype2.c:1503: error: expected 鈥�鈥�before 鈥榮ize鈥

/home/test/work/cruise/checkouts/uclinux-dist/user/microwin/src/engine/font_freetype2.c:1512: error: 鈥楩T_Error鈥�undeclared (first use in this function)

/home/test/work/cruise/checkouts/uclinux-dist/user/microwin/src/engine/font_freetype2.c:1512: error: expected 鈥�鈥�before 鈥榚rror鈥

/home/test/work/cruise/checkouts/uclinux-dist/user/microwin/src/engine/font_freetype2.c:1513: error: 鈥楩T_Vector鈥�undeclared (first use in this function)

/home/test/work/cruise/checkouts/uclinux-dist/user/microwin/src/engine/font_freetype2.c:1513: error: expected 鈥�鈥�before 鈥榢erning_delta鈥

/home/test/work/cruise/checkouts/uclinux-dist/user/microwin/src/engine/font_freetype2.c:1519: error: 鈥榚rror鈥�undeclared (first use in this function)

/home/test/work/cruise/checkouts/uclinux-dist/user/microwin/src/engine/font_freetype2.c:1519: error: 鈥榝reetype2_cache_manager鈥�undeclared (first use in this function)

/home/test/work/cruise/checkouts/uclinux-dist/user/microwin/src/engine/font_freetype2.c:1520: error: 鈥楳WFREETYPE2FONT鈥�has no member named 鈥榠magedesc 鈥

/home/test/work/cruise/checkouts/uclinux-dist/user/microwin/src/engine/font_freetype2.c:1520: error: 鈥榝ace鈥�undeclared (first use in this function)

/home/test/work/cruise/checkouts/uclinux-dist/user/microwin/src/engine/font_freetype2.c:1521: error: 鈥榮ize鈥�undeclared (first use in this function)

/home/test/work/cruise/checkouts/uclinux-dist/user/microwin/src/engine/font_freetype2.c:1551: error: 鈥榝t_kerning_default鈥�undeclared (first use in this function)

/home/test/work/cruise/checkouts/uclinux-dist/user/microwin/src/engine/font_freetype2.c:1552: error: 鈥榢erning_delta鈥�undeclared (first use in this function)

/home/test/work/cruise/checkouts/uclinux-dist/user/microwin/src/engine/font_freetype2.c:1560: warning: implicit declaration of function 鈥榝reetype2_get_glyph_size鈥

make[5]: *** [/home/test/work/cruise/checkouts/uclinux-dist/user/microwin/src/obj/engine/font_freetype2.o] Error 1

make[5]: Leaving directory `/home/test/work/cruise/checkouts/uclinux-dist/user/microwin/src/mwin'

make[4]: *** [subdir-/home/test/work/cruise/checkouts/uclinux-dist/user/microwin/src/mwin] Error 2

 

Follow-ups

 

--- Yi Li                                                    2008-04-14 05:56:22

microwin is configured to support true type by default. So it requires freetype

library to be built. I will change the configure to select freetype

automatically.

 

 

--- Yi Li                                                    2008-04-14 06:26:24

fixed

 

--- Mingquan Pan                                             2008-04-15 00:25:04

Yes,it can build through into fdpic format.Close.

 

 

 

    Files

    Changes

    Commits

    Dependencies

    Duplicates

    Associations

    Tags

 

File Name     File Type     File Size     Posted By

No Files Were Found

Attachments

    Outcomes